{"text_format":"1","workbook":"xlsx","n_sheets":13,"sheets":["{CATALOGUE}","{RECAPITULATIF}","{AIDE}","VARIABLES_LIVREES_SYST","E4A_PMI","E4A_ECOLE","E6A_ECOLE","E6A_JEU","E7A_MBG","E9A_ECOLE","E9A_COVID_T1","E9A_COVID_T2","E9A_COVID_VARIABLES"],"not_rendered":{"charts":0,"images":20,"macros":1,"external_links":0,"defined_names":41,"comments":0,"pivot_tables":0},"unopened":[],"bounds":{"document_bytes":16777216,"sheet_cells":100000,"rows_first":2000,"rows_last":500,"rows_between":2000,"halvings":0,"cell_chars":16384,"cell_head_chars":4096},"cells_cut":0,"cells_raw":0,"read":"whole","date_system":"1900"}

{"sheet":"{CATALOGUE}","index":0,"n_rows":70,"n_cols":29,"rows_kept":70,"cut":false,"hidden":false,"merged":[[1,5,3,20],[0,4,0,21],[3,0,3,2]]}
[null,null,null,null,"Catalogue des données elfe"]
[null,null,null,null,null,"Les questionnaires"]
[]
["(Mise à jour le 16/02/2026)"]
[]
[]
[]
[null,null,null,null,null,null,null,null,null,null,null,null,null,null,null,null,null,"Questionnaires des bases contextuelles :"]
[]
[null,"",null,null,null,null,null,null,null,null,null,null,null,null,null,null,null,null,"Variables maternité issues de l’Enquête Nationale Périnatale"]
[null,null,null,null,null,null,"Questionnaire enquête Ecole Moyenne Section de Maternelle"]
[null,null,null,null,null,null,null,null,null,null,null,null,null,null,null,null,null,null,"Variables d’urbanisation 2011,",null,null,null,"2014, ",null,2017]
[null,null,null,null,null,null,"Questionnaire enquête Elfe-PMI"]
[null,null,null,null,null,null,null,null,null,null,null,null,null,null,null,null,null,null,"Indice de défaveur sociale au niveau du code commune pour les années 2009 et 2015"]
[]
[]
[]
[]
[]
[]
[]
[]
[]
[null,null,null,null,null,null,"Questionnaire enquête École Cours Préparatoire"]
[]
[null,"",null,null,null,null,"Questionnaire 6 ans (jeux)",null,null,null,null,null,null,null,null,null,null,"Programmes :"]
[]
[null,null,null,null,null,null,"Questionnaire enquête 7,5 ans (MBG)",null,null,null,null,null,null,null,null,null,null,null,"Score de dépression maternelle à 2 mois"]
[]
[null,"",null,null,null,null,null,null,null,null,null,null,null,null,null,null,null,"Variables mises à disposition :"]
[]
[null,null,null,null,null,null,null,null,null,null,null,null,null,null,null,null,null,null,"Alimentation de la mère pendant les 3 derniers mois de la grossesse (EQR1)"]
[]
[null,null,null,null,null,null,null,null,null,null,null,null,null,null,null,null,null,null,"Codage des professions et secteurs d’activité des mères pendant la grossesse pour caractériser les expositions professionnelles (EQR2)"]
[null,null,null,null,null,null,"Questionnaire COVID - 1er volet"]
[null,null,null,null,null,null,null,null,null,null,null,null,null,null,null,null,null,null,"Alimentation lactée du nourrisson (EQR3)"]
[null,null,null,null,null,null,"Questionnaire COVID - 2e volet"]
[null,null,null,null,null,null,null,null,null,null,null,null,null,null,null,null,null,null,"Note méthodologique codage profession père (EQR5)"]
[null,null,null,null,null,null,"Questionnaire COVID - volet prélèvements"]
[null,null,null,null,null,null,null,null,null,null,null,null,null,null,null,null,null,null,"\nActivité physique de la mère pendant la grossesse (EQR9)"]
[null,null,null,null,null,null,"Variables sociodémographiques construites pour l’enquête COVID"]
[null,null,null,null,null,null,null,null,null,null,null,null,null,null,null,null,null,null,"Codage des malformations congénitales (EQR11)"]
[null,null,null,null,null,null,"Questionnaire enquête école en CM1"]
[null,null,null,null,null,null,null,null,null,null,null,null,null,null,null,null,null,null,"Variables sociodémographiques 0-2 ans,",null,null,null,null,"3,5 ans,",null,"5,5 ans,",null,"10,5 ans (EQR12)"]
[]
[null,null,null,null,null,null,null,null,null,null,null,null,null,null,null,null,null,null,"Indicateurs de croissance fœtale (EQR13)"]
[]
[null,null,null,null,null,null,null,null,null,null,null,null,null,null,null,null,null,null,"Codage des pathologies maternelles avant la grossesse (EQR15)"]
[]
[null,null,null,null,null,null,null,null,null,null,null,null,null,null,null,null,null,null,"Diversification alimentaire (EQR16)"]
[]
[null,null,null,null,null,null,null,null,null,null,null,null,null,null,null,null,null,null,"Apurement des données anthropométriques de 0 à 9 ans et mise à disposition d'indicateurs de croissance (EQR20)"]
[]
[null,null,null,null,null,null,null,null,null,null,null,null,null,null,null,null,null,null,"Score de qualité de l’alimentation de la mère pendant la grossesse,",null,null,null,null,null,null,null,"Annexe 1, ",null,"Annexe 2 (EQR21)"]
[]
[null,null,"",null,null,null,null,null,null,null,null,null,null,null,null,null,null,null,"Exposition aux contaminants alimentaires pendant les trois derniers mois de grossesse (EQR27)"]
[]
[null,null,null,null,null,null,null,null,null,null,null,null,null,null,null,null,null,null,"Score grammatical MacArthur à 24 mois (EQR28)"]
[]
[null,null,null,null,null,null,null,null,null,null,null,null,null,null,null,null,null,null,"Langues parlées à l'enfant à 2 mois, 1 an, 2 ans, 3 ans et demi, 5 ans et demi",null,null,null,null,null,null,null,null,"10,5 ans (EQR29)"]
[]
[null,null,null,null,null,null,null,null,null,null,null,null,null,null,null,null,null,null,"Construction d’indicateurs du trouble du neurodéveloppement (EQR30)"]
[]
[null,null,null,null,null,null,null,null,null,null,null,null,null,null,null,null,null,null,"Usage des écrans (EQR37)"]
[]
[null,null,null,null,null,null,null,null,null,null,null,null,null,null,null,null,null,null,"Traitement des données concernant le sommeil et les habitudes de sommeil de 1 à 10,5 ans (EQR38)"]
[]
[null,null,null,null,null,null,null,null,null,null,null,null,null,null,null,null,null,null,"Développement psychomoteur de l’enfant (EQR39)"]
[]
[null,null,null,null,null,null,null,null,null,null,null,null,null,null,null,null,null,null,"Calcul des scores du questionnaire M-CHAT (EQR40)"]

{"sheet":"{RECAPITULATIF}","index":1,"n_rows":44,"n_cols":28,"rows_kept":44,"cut":false,"hidden":false,"merged":[[3,3,3,5],[8,15,8,19],[9,15,9,19],[10,15,10,19],[11,15,11,19],[10,9,10,13],[13,15,13,19],[11,20,11,23],[12,15,12,19],[24,15,24,19],[25,15,25,19],[20,20,20,23],[21,20,21,23],[22,20,22,23],[24,20,24,23],[25,20,25,23],[14,15,14,19],[15,15,15,19],[15,20,15,23],[26,8,26,14],[16,9,16,13],[17,9,17,13],[23,9,23,13],[19,15,19,19],[20,15,20,19],[21,15,21,19],[22,15,22,19],[23,15,23,19],[18,15,18,19],[17,15,17,19],[16,15,16,19],[26,3,26,7],[20,9,20,13],[23,3,23,7],[0,7,3,24],[8,3,8,7],[9,3,9,7],[10,3,10,7],[11,3,11,7],[12,3,12,7],[13,3,13,7],[4,7,4,24],[5,3,6,8],[8,9,8,13],[11,9,11,13],[12,9,12,13],[9,9,9,13],[19,3,19,7],[13,9,13,13],[14,9,14,13],[16,3,16,7],[20,3,20,7],[15,9,15,13],[19,9,19,13],[14,3,14,7],[15,3,15,7],[18,9,18,13],[17,3,17,7],[18,3,18,7]]}
[null,null,null,null,null,null,null,"Récapitulatif de la sélection"]
[]
[]
[null,null,null,"(Mise à jour le 16/02/2026)"]
[]
[null,null,null,"Nb de variables sélectionnées"]
[null,null,null,null,null,null,null,null,null,"Le nombre de variables sélectionnées apparait après enregistrement du fichier."]
[]
[null,null,null,"ONGLETS",null,null,null,null,null,"Nombre de variables sélectionnées*",null,null,null,null,"Nombre de variables identifiantes\n(non-livrées)"]
[null,null,null,"E4A_PMI",null,null,null,null,null,{"$f":"LEFT(RIGHT(INDIRECT(D10&\"!D2\"),LEN(INDIRECT(D10&\"!D2\"))-19),LEN(RIGHT(INDIRECT(D10&\"!D2\"),LEN(INDIRECT(D10&\"!D2\"))-19))-12)","v":"0"},null,null,null,null,{"$f":"INDIRECT(D10&\"!AA2\")","v":0},null,null,null,null,null,null,null,null,null,null,null,{"$f":"VALUE(J10)","v":0},{"$f":"VALUE(O10)","v":0}]
[null,null,null,"E4A_ECOLE",null,null,null,null,null,{"$f":"LEFT(RIGHT(INDIRECT(D11&\"!D2\"),LEN(INDIRECT(D11&\"!D2\"))-19),LEN(RIGHT(INDIRECT(D11&\"!D2\"),LEN(INDIRECT(D11&\"!D2\"))-19))-12)","v":"0"},null,null,null,null,{"$f":"INDIRECT(D11&\"!AA2\")","v":0},null,null,null,null,null,null,null,null,null,null,null,{"$f":"VALUE(J11)","v":0},{"$f":"VALUE(O11)","v":0}]
[null,null,null,null,null,null,null,null,null,null,null,null,null,null,null,null,null,null,null,null,null,null,null,null,null,null,{"$f":"VALUE(J12)","v":0},{"$f":"VALUE(O12)","v":0}]
[null,null,null,"E6A_ECOLE",null,null,null,null,null,{"$f":"LEFT(RIGHT(INDIRECT(D13&\"!D2\"),LEN(INDIRECT(D13&\"!D2\"))-19),LEN(RIGHT(INDIRECT(D13&\"!D2\"),LEN(INDIRECT(D13&\"!D2\"))-19))-12)","v":"0"},null,null,null,null,{"$f":"INDIRECT(D13&\"!AA2\")","v":0},null,null,null,null,null,null,null,null,null,null,null,0,0]
[null,null,null,"E6A_JEU",null,null,null,null,null,{"$f":"LEFT(RIGHT(INDIRECT(D14&\"!D2\"),LEN(INDIRECT(D14&\"!D2\"))-19),LEN(RIGHT(INDIRECT(D14&\"!D2\"),LEN(INDIRECT(D14&\"!D2\"))-19))-12)","v":"0"},null,null,null,null,{"$f":"INDIRECT(D14&\"!AA2\")","v":0},null,null,null,null,null,null,null,null,null,null,null,0,0]
[null,null,null,"E7A_MBG",null,null,null,null,null,{"$f":"LEFT(RIGHT(INDIRECT(D15&\"!D2\"),LEN(INDIRECT(D15&\"!D2\"))-19),LEN(RIGHT(INDIRECT(D15&\"!D2\"),LEN(INDIRECT(D15&\"!D2\"))-19))-12)","v":"0"},null,null,null,null,{"$f":"INDIRECT(D15&\"!AA2\")","v":0},null,null,null,null,null,null,null,null,null,null,null,0,0]
[null,null,null,null,null,null,null,null,null,null,null,null,null,null,null,null,null,null,null,null,null,null,null,null,null,null,0,0]
[null,null,null,"E9A_ECOLE",null,null,null,null,null,{"$f":"LEFT(RIGHT(INDIRECT(D17&\"!D2\"),LEN(INDIRECT(D17&\"!D2\"))-19),LEN(RIGHT(INDIRECT(D17&\"!D2\"),LEN(INDIRECT(D17&\"!D2\"))-19))-12)","v":"0"},null,null,null,null,{"$f":"INDIRECT(D17&\"!AA2\")","v":0},null,null,null,null,null,null,null,null,null,null,null,0,0]
[null,null,null,"E9A_COVID_T1",null,null,null,null,null,{"$f":"LEFT(RIGHT(INDIRECT(D18&\"!D2\"),LEN(INDIRECT(D18&\"!D2\"))-19),LEN(RIGHT(INDIRECT(D18&\"!D2\"),LEN(INDIRECT(D18&\"!D2\"))-19))-12)","v":"0"},null,null,null,null,{"$f":"INDIRECT(D18&\"!AA2\")","v":0},null,null,null,null,null,null,null,null,null,null,null,0,0]
[null,null,null,"E9A_COVID_T2",null,null,null,null,null,{"$f":"LEFT(RIGHT(INDIRECT(D19&\"!D2\"),LEN(INDIRECT(D19&\"!D2\"))-19),LEN(RIGHT(INDIRECT(D19&\"!D2\"),LEN(INDIRECT(D19&\"!D2\"))-19))-12)","v":"0"},null,null,null,null,{"$f":"INDIRECT(D19&\"!AA2\")","v":0},null,null,null,null,null,null,null,null,null,null,null,0,0]
[null,null,null,"E9A_COVID_VARIABLES",null,null,null,null,null,{"$f":"LEFT(RIGHT(INDIRECT(D20&\"!D2\"),LEN(INDIRECT(D20&\"!D2\"))-19),LEN(RIGHT(INDIRECT(D20&\"!D2\"),LEN(INDIRECT(D20&\"!D2\"))-19))-12)","v":"0"},null,null,null,null,{"$f":"INDIRECT(D20&\"!AA2\")","v":0},null,null,null,null,null,null,null,null,null,null,null,0,0]
[null,null,null,null,null,null,null,null,null,null,null,null,null,null,null,null,null,null,null,null,null,null,null,null,null,null,0,0]
[null,null,null,null,null,null,null,null,null,null,null,null,null,null,null,null,null,null,null,null,null,null,null,null,null,null,0,0]
[null,null,null,null,null,null,null,null,null,null,null,null,null,null,null,null,null,null,null,null,null,null,null,null,null,null,0,0]
[null,null,null,"TOTAL var non-disponibles comprises*",null,null,null,null,null,{"$f":"SUM(AA10:AA21)","v":0}]
[null,null,null,null,null,null,null,null,null,null,null,null,null,null,null,null,null,null,null,null,null,null,null,null,null,null,0,0]
[null,null,null,null,null,null,null,null,null,null,null,null,null,null,null,null,null,null,null,null,null,null,null,null,null,null,0,0]
[null,null,null,"TOTAL des variables livrées*",null,null,null,null,{"$f":"SUM(AA10:AA21)","v":0},null,null,null,null,null,null,null,null,null,null,null,null,null,null,null,null,null,0,0]
[null,null,null,"* Ce nombre peut inclure des doublons, notamment si une variables est sélectionnée sur les 2 ou 3 colonnes de sélection (A, B et C simultanément).",null,null,null,null,null,null,null,null,null,null,null,null,null,null,null,null,null,null,null,null,null,null,0,0]
[null,null,null,null,null,null,null,null,null,null,null,null,null,null,null,null,null,null,null,null,null,null,null,null,null,null,0,0]
[null,null,null,null,null,null,null,null,null,null,null,null,null,null,null,null,null,null,null,null,null,null,null,null,null,null,0,0]
[null,null,null,null,null,null,null,null,null,null,null,null,null,null,null,null,null,null,null,null,null,null,null,null,null,null,0,0]
[null,null,null,null,null,null,null,null,null,null,null,null,null,null,null,null,null,null,null,null,null,null,null,null,null,null,0,0]
[null,null,null,null,null,null,null,null,null,null,null,null,null,null,null,null,null,null,null,null,null,null,null,null,null,null,0,0]
[null,null,null,null,null,null,null,null,null,null,null,null,null,null,null,null,null,null,null,null,null,null,null,null,null,null,0,0]
[null,null,null,null,null,null,null,null,null,null,null,null,null,null,null,null,null,null,null,null,null,null,null,null,null,null,0,0]
[null,null,null,null,null,null,null,null,null,null,null,null,null,null,null,null,null,null,null,null,null,null,null,null,null,null,0,0]
[null,null,null,null,null,null,null,null,null,null,null,null,null,null,null,null,null,null,null,null,null,null,null,null,null,null,0,0]
[null,null,null,null,null,null,null,null,null,null,null,null,null,null,null,null,null,null,null,null,null,null,null,null,null,null,0,0]
[null,null,null,null,null,null,null,null,null,null,null,null,null,null,null,null,null,null,null,null,null,null,null,null,null,null,0,0]
[null,null,null,null,null,null,null,null,null,null,null,null,null,null,null,null,null,null,null,null,null,null,null,null,null,null,0,0]
[null,null,null,null,null,null,null,null,null,null,null,null,null,null,null,null,null,null,null,null,null,null,null,null,null,null,0,0]
[null,null,null,null,null,null,null,null,null,null,null,null,null,null,null,null,null,null,null,null,null,null,null,null,null,null,0,0]
[null,null,null,null,null,null,null,null,null,null,null,null,null,null,null,null,null,null,null,null,null,null,null,null,null,null,0,0]
[null,null,null,null,null,null,null,null,null,null,null,null,null,null,null,null,null,null,null,null,null,null,null,null,null,null,{"$f":"VALUE(J44)","v":0},0]

{"sheet":"{AIDE}","index":2,"n_rows":225,"n_cols":9,"rows_kept":225,"cut":false,"hidden":false,"merged":[[62,4,62,5],[0,7,0,24],[1,8,3,23],[3,3,3,5]]}
[null,null,null,null,null,null,null,"Catalogue des données elfe"]
[null,null,null,null,null,null,null,null,"Aide"]
[]
[null,null,null,"(Mise à jour le 16/02/2026)"]
[]
[]
[null,null,null,null,"SOMMAIRE (cliquer sur les titres pour accéder aux parties)"]
[]
[]
[null,null,null,null,"Le fichier Catalogue et ses différents onglets"]
[null,null,null,null,"Introduction"]
[null,null,null,null,"L'onglet CATALOGUE "]
[null,null,null,null,"L'onglet VARIABLES CONSTRUITES"]
[null,null,null,null,"L'onglet BASES CONTEXTUELLES"]
[null,null,null,null,"Les onglets ENQUÊTES (MATER_... à E9A_...)"]
[]
[]
[null,null,null,null,"Affichage"]
[null,null,null,null,"Affichage des sections"]
[null,null,null,null,"Filtre des thèmes"]
[]
[]
[null,null,null,null,"Sélection des variables"]
[null,null,null,null,"Sélection variable par variable"]
[null,null,null,null,"Sélection par section"]
[null,null,null,null,"Sélection par thème 1"]
[null,null,null,null,"Sélection par Quest Standard"]
[]
[]
[]
[]
[]
[]
[]
[]
[]
[]
[]
[]
[]
[null,null,null,null,"Le fichier Catalogue et ses différents onglets"]
[]
[null,null,null,null,"Introduction"]
[null,null,null,null,"Pour commencer à utiliser le fichier Catalogue et afin d'optimiser son fonctionnement, il est important d'activer la modification du fichier et les macros :"]
[]
[]
[]
[]
[]
[]
[]
[]
[]
[]
[]
[]
[]
[null,null,null,null,"L'onglet CATALOGUE "]
[]
[]
[null,null,null,null,"L'onglet CATALOGUE contient des liens vers les questionnaires d'enquêtes ELFE, les variables construites et les bases contextuelles."]
[null,null,null,null,"Ces différents PDF sont également disponibles sur le site Pandora :"]
[null,null,null,null,"Page d'accueil de Pandora"]
[]
[null,null,null,null,"L'onglet VARIABLES CONSTRUITES"]
[]
[]
[null,null,null,null,"L'onglet VARIABLES CONSTRUITES contient les différentes variables construites (EQR) pour la sélection."]
[null,null,null,null,"Se référer à la partie \"Sélection des variables\" pour plus d'informations."]
[]
[null,null,null,null,"L'onglet BASES CONTEXTUELLES"]
[]
[]
[null,null,null,null,"L'onglet BASES CONTEXTUELLES contient les différentes bases contextuelles (BC) pour la sélection."]
[null,null,null,null,"Se référer à la partie \"Sélection des variables\" pour plus d'informations."]
[]
[null,null,null,null,"Les onglets _FORMAT"]
[]
[]
[null,null,null,null,"Les onglets _FORMAT sont présents à titre indicatif. Ils contiennent les formats relatifs à chaque période d'enquêtes."]
[]
[null,null,null,null,"Les onglets ENQUÊTES (de MATER_ à E9A_)"]
[]
[]
[null,null,null,null,"Les onglets ENQUÊTES de MATER_ à E9A_ contiennent les variables de chaque enquête pour la sélection."]
[null,null,null,null,"Se référer à la partie \"Sélection des variables\" pour plus d'informations."]
[]
[]
[null,null,null,null,"Affichage"]
[]
[null,null,null,null,"Affichage des sections "]
[]
[null,null,null,null,"Les variables sont regroupées par section. "]
[null,null,null,null,"L'affichage des variables d'une section / d'un module se fait :"]
[null,null,null,null,"- soit en cliquant sur le bouton",null,null,null,"qui permet de \"dégrouper\" tous les regroupements, donc d'afficher toutes les variables,"]
[null,null,null,null,"- soit par le bouton ",null,null,"situé devant chaque section  et qui permet de \"dégrouper\" une section  spécifique."]
[]
[]
[]
[]
[]
[]
[]
[]
[]
[]
[]
[]
[]
[]
[]
[]
[]
[]
[]
[]
[]
[]
[]
[]
[]
[]
[null,null,null,null,"Filtre des thèmes"]
[null,null,null,null,"Les différents thèmes peuvent être  affichées à l'aide du filtre "]
[]
[]
[]
[]
[]
[]
[]
[]
[]
[]
[]
[]
[]
[]
[]
[]
[]
[]
[]
[]
[]
[]
[]
[]
[]
[null,null,null,null,"Sélection des variables"]
[]
[null,null,null,null,"Sélection variable par variable"]
[null,null,null,null,"La sélection peut se faire variable par variable en colonne A en cochant la ligne correspondant à la variable souhaitée (saisir la valeur \"X\" dans la colonne A ligne voulue)."]
[null,null,null,null,"Ici la variable A02M_VALIDCM1 est sélectionnée."]
[]
[]
[]
[]
[]
[]
[]
[]
[]
[]
[]
[]
[]
[]
[]
[null,null,null,null,"Sélection par section"]
[null,null,null,null,"La sélection peut se faire par section (chapitre d'enquête). Lorsque la valeur \"X\" est indiquée sur la ligne correspondant à une section (ligne grisée), toutes les variables de la section seront sélectionnées automatiquement."]
[]
[]
[]
[]
[]
[]
[]
[]
[]
[]
[]
[]
[]
[]
[]
[null,null,null,null,"Ici toutes les variables de la section \"Contact avec la mère\" seront sélectionnées."]
[]
[]
[]
[]
[]
[]
[]
[]
[]
[]
[]
[]
[]
[]
[]
[]
[null,null,null,null,"Sélection par thème 1"]
[null,null,null,null,"La sélection peut également se faire par le thème 1 (thème 1 renseigné en colonne R - le thème 1 est le thème principal rattaché à une variable). Lorsque la valeur \"X\" est indiquée en colonne B et sur la ligne correspondant au thème souhaité, toutes les variables faisant référence au thème choisi seront sélectionnées."]
[null,null,null,null,"Par exemple, si la valeur X est saisie en B5 comme ci-dessous en rouge, toutes les variables contenant \"gestion étude\" en thème 1 ou colonne R seront aussi sélectionnées."]
[]
[]
[]
[]
[]
[]
[]
[]
[]
[]
[]
[]
[]
[]
[]
[null,null,null,null,"Sélection par Questionnaire Standard"]
[null,null,null,null,"La sélection peut aussi se faire par la colonne 'Quest Standard' (Questionnaire standard renseigné en colonne X). "]
[null,null,null,null,"Comme pour la sélection par thème 1, lorsque la valeur \"X\" est indiquée en colonne C et sur la ligne correspondant au 'Questionnaire standard' souhaité, toutes les variables faisant référence au Questionnaire standard choisi seront sélectionnées."]
[null,null,null,null,"Par exemple, si la valeur X est saisie en colonne C comme ci-dessous en rouge, toutes les variables contenant \"K6\" dans le 'Questionnaire standard' (colonne X) seront sélectionnées."]

{"sheet":"VARIABLES_LIVREES_SYST","index":3,"n_rows":105,"n_cols":52,"rows_kept":105,"cut":false,"hidden":false,"merged":[]}
["SELECTION\n(par variable ou par section)","SELECTION\n(par thème 1)","SELECTION\n(par QUEST STANDARD)","LABEL","QUESTION QUESTIONNAIRE","QUESTION BASE",null,null,"TYPE","FORMAT","CHAPEAU","DICO","DESCRIPTION","CONTRÔLE","THEME(01)","THEME(02)","THEME(03)","THEME1","THEME2","THEME3","THEME4","THEME5","THEME6","QUEST STANDARD","THEME_TITRE",null,null,null,"Nombre de variables","PANDORA",null,"",null,null,null,null,null,null,null,null,null,null,null,null,null,null,null,null,null,null,"MATER_FCC","MATER_FCC"]
[null,null,null,"Sélection totale : 0 variable(s)",null,{"$f":"SUM((IF(ISERROR(AF:AF),\"\",AF:AF)))","v":0},null,null,null,null,null,null,null,null,null,null,null,null,null,null,null,null,null,null,null,null,0,0,null,"non"]
[null,null,null,"VARIABLES CONSTRUITES SOCIODÉMO (EQR0) (selon enquête demandée)",null,null,null,null,null,null,null,null,null,null,null,null,null,null,null,null,null,null,null,null,1]
[null,null,null,"La mère / le père est décédé.e (enquête 2 mois à 10 ans)","VIE_M / VIE_P","VIE_M / VIE_P (de M02 à A10)",null,null,"livrée systématiquement","dico",null,"VITAL","La mère / le père est décédé.e (enquête 2 mois à 10 ans)"]
[null,null,null,"Sexe de la mère / du père (enquête 2 mois à 10 ans)","SEXE_M / SEXE_P","SEXE_M / SEXE_P (de M02 à A10)",null,null,"livrée systématiquement","dico",null,"SEXE","Sexe de la mère / du père (enquête 2 mois à 10 ans)"]
[null,null,null,"Age de la mère / du père (enquête 2 mois à 10 ans)","AGE_M / AGE_P","AGE_M / AGE_P (de M02 à A10)",null,null,"livrée systématiquement","num",null,null,"Age de la mère / du père (enquête 2 mois à 10 ans)"]
[null,null,null,"Niveau d'études de la mère / du père (enquête 2 mois à 10 ans)","EDUC_M / EDUC_P","EDUC_M / EDUC_P (de M02 à A10)",null,null,"livrée systématiquement","dico",null,"EDUC","Niveau d'études de la mère / du père (enquête 2 mois à 10 ans)"]
[null,null,null,"Occupation principale de la mère / du père (enquête 2 mois à 10 ans)","OCCUP_M / OCCUP_P","OCCUP_M / OCCUP_P (de M02 à A10)",null,null,"livrée systématiquement","dico",null,"EMPLOI","Occupation principale de la mère / du père (enquête 2 mois à 10 ans)"]
[null,null,null,"Statut du père (enquête 2 mois à 10 ans)","STATUT_P","STATUT_P (de M02 à A10)",null,null,"livrée systématiquement","dico",null,"STATP","Statut du père (enquête 2 mois à 10 ans)"]
[null,null,null,"Professions et catégories socioprofessionnelles (en 8 postes) de la mère / du père (enquête 2 mois à 10 ans)","PCS08_M / PCS08_P","PCS08_M / PCS08_P (de M02 à A10)",null,null,"livrée systématiquement","dico",null,"$PCS8C","Professions et catégories socioprofessionnelles (en 8 postes) de la mère / du père (enquête 2 mois à 10 ans)"]
[null,null,null,"Professions et catégories socioprofessionnelles (en 24 postes) de la mère / du père (enquête 2 mois à 10 ans)","PCS24_M / PCS24_P","PCS24_M / PCS24_P (de M02 à A10)",null,null,"livrée systématiquement","dico",null,"$PCS24C","Professions et catégories socioprofessionnelles (en 24 postes) de la mère / du père (enquête 2 mois à 10 ans)"]
[null,null,null,"Professions et catégories socioprofessionnelles (en 42 postes) de la mère / du père (enquête 2 mois à 10 ans)","PCS42_M / PCS42_P","PCS42_M / PCS42_P (de M02 à A10)",null,null,"livrée systématiquement","dico",null,"$PCS42C","Professions et catégories socioprofessionnelles (en 42 postes) de la mère / du père (enquête 2 mois à 10 ans)",null,null,null,null,null,null,null,null,null,null,null,0]
[null,null,null,"Différence de niveau de diplôme entre les parents (enquête 2 mois à 10 ans)","DIFFEDUC_MP","EDUCDIFF_MP (de M02 à A10)",null,null,"livrée systématiquement","dico",null,"FMEDUCDIFF","Différence de niveau de diplôme entre les parents (enquête 2 mois à 10 ans)",null,null,null,null,null,null,null,null,null,null,null,0]
[null,null,null,"VARIABLES D'ENQUÊTE",null,null,null,null,null,null,null,null,null,null,null,null,null,null,null,null,null,null,null,null,1,null,null,null,null,"non"]
[null,null,null,"Vague de naissance de l'enfant Elfe","VAGUE","VAGUE",null,null,"livrée systématiquement","dico","","VAGUE","Numéro vague","","vague 1, 2, 3 et 4","maternité","consentement","","","","","","variable de gestion","",null,null,null,null,{"$f":"IF(ISBLANK(F15),\"\",LEN(F15)-LEN(SUBSTITUTE(F15,\"/\",\"\"))+1)","v":1},"oui",{"$f":"IF(A15=\"X\",1,\"\")","v":""},{"$f":"IF(ISNUMBER(AE15),AC15*AE15,\"\")","v":""}]
[null,null,null,"Sexe enfant Elfe","SEXE_ENF","SEXE_ENF","",null,"livrée systématiquement","dico",null,"SEXE","Sexe enfant Elfe",null,"réferent","Etat civil","","Etat civil","","","","","variable de gestion","",null,null,null,null,{"$f":"IF(ISBLANK(F16),\"\",LEN(F16)-LEN(SUBSTITUTE(F16,\"/\",\"\"))+1)","v":1},"oui",{"$f":"IF(A16=\"X\",1,\"\")","v":""},{"$f":"IF(ISNUMBER(AE16),AC16*AE16,\"\")","v":""}]
[null,null,null,"Naissance gémellaire","NAISGEM","NAISGEM","",null,"livrée systématiquement","dico",null,"YORN","Naissance gémellaire",null,"réferent","Etat civil","","Etat civil",null,null,null,null,null,null,null,null,null,null,1,null,"",""]
[null,null,null,"Rang du jumeau (généré aléatoirement: permet sélection aléatoire de l'un des jumeaux)","RANGALEA","RANGALEA",null,null,"livrée systématiquement","num","","","Rang du jumeau (généré aléatoirement)",null,"vague 1, 2, 3 et 4","maternité","consentement",null,null,"","","","","variable construite",null,null,null,null,1,null,"",""]
[null,null,null,"Aujourd'hui [enfant Elfe] vit-il :","EFVIT","EFVIT (de M02 à A10)",null,null,"livrée systématiquement","dico",null,"EFVIT","Personne(s) avec qui vit l'enfant",null,null,null,null,null,null,null,null,null,"INFORMATIONS SUR L'ENFANT ELFE",null,null,null,null,null,1,null,"",""]
[null,null,null,"Référent de l’enquête précédente","QUIREF / QUIREFFIN","QUIREF (de A03 à A05)","A05C_QUIREF","A05N_QUIREF","livrée systématiquement","dico",null,"SEXE","Référent de l’enquête précédente",null,"réferent","Gestion étude","","Gestion étude",null,null,null,null,null,null,null,null,null,null,1,null,"",""]
[null,null,null,"Parent répondant","QUIREP","QUIREP (de A05 à A10)","A05C_QUIREP","A05N_QUIREP","livrée systématiquement","dico",null,"SEXE","Parent répondant",null,"réferent","Gestion étude","","Gestion étude",null,null,null,null,null,null,0,null,null,null,1,null,"",""]
[null,null,null,"MATER - PONDÉRATION (si variables en maternité demandées)",null,null,null,null,null,null,null,null,null,null,null,null,null,null,null,null,null,null,null,null,1,null,null,null,"","non","",""]
[null,"","","Pondération enquête maternité pour travailler\nau niveau nourrisson","PONDVALC2","M00E_PONDVALC2",null,null,"livrée systématiquement","num"," ",null,"Valeur de la pondération enquête\nmaternité pour travailler au\nniveau nourrisson"," ","maternité","père","gestion étude",null,null,null,null,null,null,null,null,null,null,null,1,"oui","",""]
[null,"","","Pondération enquête maternité pour travailler\nau niveau famille","PONDVALC2","M00F_PONDVALC2",null,null,"livrée systématiquement","num"," ",null,"Valeur de la pondération enquête\nmaternité pour travailler au\nniveau famille"," ","maternité","père","gestion étude",null,null,null,null,null,null,null,null,null,null,null,1,"oui","",""]
[null,null,null,"Strate de la maternité","MATSTRATE","M00M1_MATSTRATE",null,null,"livrée systématiquement","dico","","MATSTRAT","Strate de la maternité",null,"vague 1, 2, 3 et 4","maternité","consentement","consentement",null,"","","","","",null,null,null,null,1,"oui","",""]
[null,null,null,"identifiant maternité (généré aléatoirement)","IDGROUPNAMEALEAC","M00M1_IDGROUPNAMEALEAC",null,null,"livrée systématiquement","num","","","Identifiant maternité (généré aléatoirement)",null,"vague 1, 2, 3 et 4","maternité","consentement","consentement",null,"","","","variable de gestion","",0,null,null,null,1,"non","",""]
[null,null,null,"E2M-10M ALIMENTATION - PONDÉRATION (si variables à 2 mois - alimentation demandées)",null,null,null,null,null,null,null,null,null,null,null,null,null,null,null,null,null,null,null,null,1,null,null,null,"","oui","",""]
[null,"",null,"Pondération enquête alimentation enfant pour travailler au niveau enfant","POND","M02E1_POND",null,null,"livrée systématiquement","num",null,null,"Pondération enquête alimentation enfant pour travailler au niveau enfant","","2-10mois","pondération","enfant",null,"","","","",null,null,null,null,null,null,1,"non","",""]
[null,"",null,"Pondération enquête alimentation enfant pour travailler au niveau famille","POND","M02F1_POND",null,null,"livrée systématiquement","num",null,null,"Pondération enquête alimentation enfant pour travailler au niveau famille","","2-10mois","pondération","enfant",null,"","","","",null,null,0,null,null,null,1,"oui","",""]
[null,null,null,"E2M - PARTICIPATION (si variables à 2 mois demandées)",null,null,null,null,null,null,null,null,null,null,null,null,null,null,null,null,null,null,null,null,1,null,null,null,"","oui","",""]
[null,null,null,"Participation ou non-participation du ménage","PARTICIPMEN","M02R_PARTICIPMEN / M02C_PARTICIPMEN / M02N_PARTICIPMEN",null,null,"livrée systématiquement","dico",null,"$E02M_PARTICIP."]
[null,null,null,"Type de participation du ménage","TYPPARTMEN","M02R_TYPPARTMEN / M02C_TYPPARTMEN / M02N_TYPPARTMEN",null,null,"livrée systématiquement","dico",null,"$E02M_TYPPARTI."]
[null,null,null,"Type et compléture questionnaire parent référent",{"$f":"RIGHT(F33,LEN(F33)-5)","v":"QUESTREF"},"M02R_QUESTREF",null,null,"livrée systématiquement","dico",null,"$E02M_QREF.","Type et compléture questionnaire parent référent"]
[null,null,null,"Type et compléture questionnaire parent cohabitant","QUESTCOH","M02C_QUESTCOH",null,null,"livrée systématiquement","dico",null,"$E02M_QCOH.","Type et compléture questionnaire parent cohabitant"]
[null,null,null,"Type et compléture questionnaire parent non-cohabitant","QUESTNCO","M02N_QUESTNCO",null,null,"livrée systématiquement","dico",null,"$E02M_QNCO.","Type et compléture questionnaire parent non-cohabitant"]
[null,null,null,"Complétude du questionnaire logement posé au référent","LOG2MREF","M02X_LOG2MREF",null,null,"livrée systématiquement","dico","","COMPLET2V","Type de questionnaire logement posé au référent",null,"questionnaire répondants","gestion","",null,null,null,null,null,null,null,null,null,null,null,1,"non","",""]
[null,null,null,"Complétude du questionnaire logement posé au non cohabitant","LOG2MNCO","M02X_LOG2MNCO",null,null,"livrée systématiquement","dico","","COMPLET2V","Type de questionnaire logement posé au non cohabitant",null,"questionnaire répondants","gestion","",null,null,null,null,null,null,null,0,null,null,null,1,"oui","",""]
[null,null,null,"E2M - PONDÉRATION (si variables à 2 mois demandées)",null,null,null,null,null,null,null,null,null,null,null,null,null,null,null,null,null,null,null,null,1,null,null,null,"","oui","",""]
[null,null,null,"Pondération enquête 2 mois pour travailler au niveau enfant sur le sous échantillon des questionnaires référents complets","PONDREFC2","M02E_PONDREFC2",null,null,"livrée systématiquement","num","",null,"Pondération enquête 2 mois pour travailler au niveau enfant sur le sous échantillon des questionnaires référents complets",null,"questionnaire 2 mois","pondération","enfant",null,null,null,null,null,null,null,null,null,null,null,1,"oui","",""]
[null,null,null,"Pondération enquête 2 mois pour travailler au niveau enfant sur le sous échantillon des questionnaires référents et non référent complets","PONDNONREFC2","M02E_PONDNONREFC2",null,null,"livrée systématiquement","num","",null,"Pondération enquête 2 mois pour travailler au niveau enfant sur le sous échantillon des questionnaires référents et non référent complets",null,"questionnaire 2 mois","pondération","enfant",null,null,null,null,null,null,null,null,null,null,null,1,"oui","",""]
[null,null,null,"Pondération enquête 2 mois pour travailler au niveau famille sur le sous échantillon des questionnaires référents complets","PONDREFC2","M02F2_PONDREFC2",null,null,"livrée systématiquement","num","",null,"Pondération enquête 2 mois pour travailler au niveau famille sur le sous échantillon des questionnaires référents complets",null,"questionnaire 2 mois","pondération","famille",null,null,null,null,null,null,null,null,null,null,null,1,"non","",""]
[null,null,null,"Pondération enquête 2 mois pour travailler au niveau famille  sur le sous échantillon des questionnaires référents et non référent complets","PONDNONREFC2","M02F2_PONDNONREFC2",null,null,"livrée systématiquement","num","",null,"Pondération enquête 2 mois pour travailler au niveau famille  sur le sous échantillon des questionnaires référents et non référent complets",null,"questionnaire 2 mois","pondération","famille",null,null,null,null,null,null,null,0,null,null,null,1,"non","",""]
[null,null,null,"E1A - PARTICIPATION (si variables à 1 an demandées)",null,null,null,null,null,null,null,null,null,null,null,null,null,null,null,null,null,null,null,null,1,null,null,null,"","non","",""]
[null,null,null,"Participation du ménage","PARTICIPMEN","A01R_PARTICIPMEN / A01C_PARTICIPMEN / A01N_PARTICIPMEN",null,null,"livrée systématiquement","dico",null,"$E1A_G_PARTICIP.","Participation du ménage"]
[null,null,null,"Type de participation des parents","TYPPARTMEN","A01R_TYPPARTMEN / A01C_TYPPARTMEN / A01N_TYPPARTMEN",null,null,"livrée systématiquement","dico",null,"$E1A_G_TYPPARTI.","Type de participation des parents"]
[null,null,null,"Type et compléture questionnaire parent référent","QUESTREF","A01R_QUESTREF",null,null,"livrée systématiquement","dico",null,"$E1A_G_QREF","Type et compléture questionnaire parent référent"]
[null,null,null,"Type et compléture questionnaire parent cohabitant","QUESTCOH","A01C_QUESTCOH",null,null,"livrée systématiquement","num",null,null,"Type et compléture questionnaire parent cohabitant"]
[null,null,null,"Type et compléture questionnaire parent non-cohabitant","QUESTNCO","A01N_QUESTNCO",null,null,"livrée systématiquement","dico",null,"$E1A_G_QNCO.","Type et compléture questionnaire parent non-cohabitant"]
[null,null,null,"E1A - PONDÉRATION (si variables à 1 an demandées)",null,null,null,null,null,null,null,null,null,null,null,null,null,null,null,null,null,null,null,null,1,null,null,null,"","oui","",""]
[null,null,null,"Pondération enquête 1 an pour travailler au niveau enfant sur le sous échantillon des questionnaires référents complets",{"$f":"RIGHT(F50,LEN(F50)-5)","v":"PONDREF"},"A01E_PONDREF",null,null,"livrée systématiquement","num",null,null,"Pondération enquête 1 an pour travailler au niveau enfant sur le sous échantillon des questionnaires référents complets",null,"questionnaire 1 an","pondération","enfant",null,null,null,null,null,null,null,null,null,null,null,1,"oui","",""]
[null,null,null,"Pondération enquête 1 an pour travailler au niveau enfant sur le sous échantillon des questionnaires référents et non référent complets",{"$f":"RIGHT(F51,LEN(F51)-5)","v":"PONDNONREF"},"A01E_PONDNONREF",null,null,"livrée systématiquement","num",null,null,"Pondération enquête 1 an pour travailler au niveau enfant sur le sous échantillon des questionnaires référents et non référent complets",null,"questionnaire 1 an","pondération","enfant",null,null,null,null,null,null,null,null,null,null,null,1,"oui","",""]
[null,null,null,"Pondération enquête 1 an pour travailler au niveau famille sur le sous échantillon des questionnaires référents complets","PONDREF","A01F_PONDREF",null,null,"livrée systématiquement","num",null,null,"Pondération enquête 1 an pour travailler au niveau famille sur le sous échantillon des questionnaires référents complets",null,"questionnaire 1 an","pondération","famille",null,null,null,null,null,null,null,null,null,null,null,1,"oui","",""]
[null,null,null,"Pondération enquête 1 an pour travailler au niveau famille sur le sous échantillon des questionnaires référents et non référent complets","PONDNONREF","A01F_PONDNONREF",null,null,"livrée systématiquement","num",null,null,"Pondération enquête 1 an pour travailler au niveau famille sur le sous échantillon des questionnaires référents et non référent complets",null,"questionnaire 1 an","pondération","famille",null,null,null,null,null,null,null,null,null,null,null,1,"oui","",""]
[null,null,null,"Pondération enquête 1 an pour travailler au niveau enfant sur le sous échantillon des questionnaires référents complets jusqu’à l’enquête 1 an","LONGPONDREF","A01E_LONGPONDREF",null,null,"livrée systématiquement","num",null,null,"Pondération enquête 1 an pour travailler au niveau enfant sur le sous échantillon des questionnaires référents complets jusqu'à l'enquête 1 an",null,"questionnaire 1 an","pondération","enfant",null,null,null,null,null,null,null,null,null,null,null,1,"oui","",""]
[null,null,null,"Pondération enquête 1 an pour travailler au niveau enfant sur le sous échantillon des questionnaires référents et non-référent complets jusqu’à l’enquête 1 an","LONGPONDNONREF","A01E_LONGPONDNONREF",null,null,"livrée systématiquement","num",null,null,"Pondération enquête 1 an pour travailler au niveau enfant sur le sous échantillon des questionnaires référents et non-référent complets jusqu'à l'enquête 1 an",null,"questionnaire 1 an","pondération","enfant",null,null,null,null,null,null,null,null,null,null,null,1,"oui","",""]
[null,null,null,"Pondération enquête 1 an pour travailler au niveau famille sur le sous échantillon des questionnaires référents complets jusqu’à l’enquête 1 an","LONGPONDREF","A01F_LONGPONDREF",null,null,"livrée systématiquement","num",null,null,"Pondération enquête 1 an pour travailler au niveau famille sur le sous échantillon des questionnaires référents complets jusqu'à l'enquête 1 an",null,"questionnaire 1 an","pondération","famille",null,null,null,null,null,null,null,null,null,null,null,1,"non","",""]
[null,null,null,"Pondération enquête 1 an pour travailler au niveau famille sur le sous échantillon des questionnaires référents et non-référent complets jusqu’à l’enquête 1 an","LONGPONDNONREF","A01F_LONGPONDNONREF",null,null,"livrée systématiquement","num",null,null,"Pondération enquête 1 an pour travailler au niveau famille sur le sous échantillon des questionnaires référents et non-référent complets jusqu'à l'enquête 1 an",null,"questionnaire 1 an","pondération","famille",null,null,null,null,null,null,null,0,null,null,null,1,"non","",""]
[null,null,null,"E2A - PARTICIPATION (si variables à 2 ans demandées)",null,null,null,null,null,null,null,null,null,null,null,null,null,null,null,null,null,null,null,null,1,null,null,null,"","non","",""]
[null,null,null,"Participation ménage","PARTICIPMEN","A02R_PARTICIPMEN / A02C_PARTICIPMEN / A02N_PARTICIPMEN",null,null,"livrée systématiquement","dico",null,"$E2A_G_PARTICIP.","Participation ménage"]
[null,null,null,"Type de participation des parents","TYPPARTMEN","A02R_TYPPARTMEN / A02C_TYPPARTMEN / A02N_TYPPARTMEN",null,null,"livrée systématiquement","dico",null,"$E2A_G_TYPPARTI.","Type de participation des parents"]
[null,null,null,"Type et compléture questionnaire parent référent","QUESTREF","A02R_QUESTREF",null,null,"livrée systématiquement","dico",null,"$E2A_G_QREF.","Type et compléture questionnaire parent référent"]
[null,null,null,"Type et compléture questionnaire parent cohabitant","QUESTCOH","A02C_QUESTCOH",null,null,"livrée systématiquement","num",null,"$E2A_G_QCOH.","Type et compléture questionnaire parent cohabitant"]
[null,null,null,"Type et compléture questionnaire parent non-cohabitant","QUESTNCO","A02N_QUESTNCO",null,null,"livrée systématiquement","dico",null,"$E2A_G_QNCO.","Type et compléture questionnaire parent non-cohabitant"]
[null,null,null,"Type de ménage, mère","MENAGEM2A","A02X_MENAGEM2A",null,10,"livrée systématiquement","dico",null,"MENAGEM","Type de ménage, mère","","2ans","tél. répondant","gestion",null,null,null,null,null,null,null,0,null,null,null,1,"oui","",""]
[null,null,null,"E2A - PONDÉRATION (si variables à 2 ans demandées)",null,null,null,null,null,null,null,null,null,null,null,null,null,null,null,null,null,null,null,null,1,null,null,null,"","oui","",""]
[null,null,null,"Pondération enquête 2 ans pour travailler au niveau enfant sur le sous échantillon des questionnaires référents complets",{"$f":"RIGHT(F66,LEN(F66)-5)","v":"PONDREF"},"A02E_PONDREF",null,null,"livrée systématiquement","num",null,null,"Pondération enquête 2 ans pour travailler au niveau enfant sur le sous échantillon des questionnaires référents complets",null,"questionnaire 1 an","pondération","enfant",null,null,null,null,null,null,null,null,null,null,null,1,"oui","",""]
[null,null,null,"Pondération enquête 2 ans pour travailler au niveau enfant sur le sous échantillon des questionnaires référents et non référent complets",{"$f":"RIGHT(F67,LEN(F67)-5)","v":"PONDNONREF"},"A02E_PONDNONREF",null,null,"livrée systématiquement","num",null,null,"Pondération enquête 2 ans pour travailler au niveau enfant sur le sous échantillon des questionnaires référents et non référent complets",null,"questionnaire 1 an","pondération","enfant",null,null,null,null,null,null,null,null,null,null,null,1,"oui","",""]
[null,null,null,"Pondération enquête 2 ans pour travailler au niveau famille sur le sous échantillon des questionnaires référents complets","PONDREF","A02F_PONDREF",null,null,"livrée systématiquement","num",null,null,"Pondération enquête 2 ans pour travailler au niveau famille sur le sous échantillon des questionnaires référents complets",null,"questionnaire 1 an","pondération","famille",null,null,null,null,null,null,null,null,null,null,null,1,"non","",""]
[null,null,null,"Pondération enquête 2 ans pour travailler au niveau famille sur le sous échantillon des questionnaires référents et non référent complets","PONDNONREF","A02F_PONDNONREF",null,null,"livrée systématiquement","num",null,null,"Pondération enquête 2 ans pour travailler au niveau famille sur le sous échantillon des questionnaires référents et non référent complets",null,"questionnaire 1 an","pondération","famille",null,null,null,null,null,null,null,null,null,null,null,1,"non","",""]
[null,null,null,"Pondération enquête 2 ans pour travailler au niveau famille sur le sous échantillon des questionnaires référents complets jusqu'\u0092à l\u0092'enquête 2 ans","LONGPONDNONREF","A02E_LONGPONDNONREF",null,1,"livrée systématiquement","num",null,null,"Pondération enquête 2 ans pour travailler au niveau enfant sur le sous échantillon des questionnaires référents complets jusqu'à l 'enquête 2 ans",null,"mt",null,null,null,null,null,null,null,"questionnaire médecin traitant",null,null,null,null,null,1,"non","",""]
[null,null,null,"Pondération enquête 2 ans pour travailler au niveau famille sur le sous échantillon des\nquestionnaires référents et non-référents\ncomplets jusqu'\u0092à l'enquête 2 ans","LONGPONDNONREF","A02F_LONGPONDNONREF",null,2,"livrée systématiquement","num",null,null,"Pondération enquête 2 ans pour travailler au niveau famille sur le sous échantillon des questionnaires référents et non-référents complets jusqu' à l'enquête 2 ans",null,"mt",null,null,null,null,null,null,null,"questionnaire médecin traitant",null,null,null,null,null,1,null,"",""]
[null,null,null,"Pondération enquête 2 ans pour travailler au niveau enfant sur le sous échantillon des questionnaires référents complets jusqu\u0092'à\nl\u0092'enquête 2 ans","LONGPONDREF","A02E_LONGPONDREF",null,3,"livrée systématiquement","num",null,null,"Pondération enquête 2 ans pour travailler au niveau enfant sur le sous échantillon des questionnaires référents complets jusqu 'à l 'enquête 2 ans",null,"mt",null,null,null,null,null,null,null,"questionnaire médecin traitant",null,null,null,null,null,1,null,"",""]
[null,null,null,"Pondération enquête 2 ans pour travailler au niveau enfant sur le sous chantillon des\nquestionnaires référents et non-référents\ncomplets jusqu'\u0092à l\u0092'enquête 2 ans","LONGPONDREF","A02F_LONGPONDREF",null,null,"livrée systématiquement","num",null,null,"Pondération enquête 2 ans pour travailler au niveau famille sur le sous échantillon des questionnaires référents et non-référents complets jusqu' à l 'enquête 2 ans",null,null,null,null,null,null,null,null,null,null,null,0,null,null,null,1,null,"",""]
[null,null,null,"E3A - PONDÉRATION (si variables à 3 ans demandées)",null,null,null,null,null,null,null,null,null,null,null,null,null,null,null,null,null,null,null,null,1,null,null,null,"",null,"",""]
[null,null,null,"Pondération enquête 3 ans pour travailler au niveau enfant sur le sous échantillon des questionnaires complets","PONDREF","A03E_PONDREF",null,1,"livrée systématiquement","num","","","Pondération enquête 3 ans pour travailler au niveau enfant sur le sous échantillon des questionnaires référents complets","","questionnaire 3 ans","pondération","enfant",null,null,null,null,null,null,null,null,null,null,null,1,null,"",""]
[null,null,null,"Pondération enquête 3 ans pour travailler au niveau enfant sur le sous échantillon des questionnaires complets jusqu’à l’enquête 3 ans","LONGPONDREF","A03E_LONGPONDREF",null,2,"livrée systématiquement","num","","","Pondération enquête 3 ans pour travailler au niveau enfant sur le sous échantillon des questionnaires référents complets jusqu’à l’enquête 3 ans","","questionnaire 3 ans","pondération","enfant",null,null,null,null,null,null,null,0,null,null,null,1,null,"",""]
[null,null,null,"E3A - PARTICIPATION (si variables à 3 ans demandées)",null,null,null,null,null,null,null,null,null,null,null,null,null,null,null,null,null,null,null,null,1,null,null,null,"",null,"",""]
[null,null,null,"Participation de la mère ou du père comme référent","PARTIREF3A","A03R_PARTIREF3A",null,2,"livrée systématiquement","dico","","E3ARF_FC_PARTIREF3A","Participation de la mère ou du père comme référent","","3 ans 5","tél. référent","gestion mère","gestion étude",null,null,null,null,null,null,null,null,null,null,1,null,"",""]
[null,null,null,"Complétude du questionnaire de la mère si elle est référent","MREFCOMP3A","A03R_MREFCOMP3A / A03R2_MREFCOMP3A",null,3,"livrée systématiquement","dico","","E3ARF_FC_MREFCOMP3A","Complétude du questionnaire de la mère si elle est référent","","3 ans 5","tél. référent","gestion mère","gestion étude",null,null,null,null,null,null,null,null,null,null,2,null,"",""]
[null,null,null,"Complétude du questionnaire du père s'il est référent","PREFCOMP3A","A03R_PREFCOMP3A / A03R2_PREFCOMP3A",null,4,"livrée systématiquement","dico","","E3ARF_FC_PREFCOMP3A","Complétude du questionnaire du père s’il est référent","","3 ans 5","tél. référent","gestion mère","gestion étude",null,null,null,null,null,null,null,null,null,null,{"$f":"IF(ISBLANK(F80),\"\",LEN(F80)-LEN(SUBSTITUTE(F80,\"/\",\"\"))+1)","v":2},null,{"$f":"IF(A80=\"X\",1,\"\")","v":""},{"$f":"IF(ISNUMBER(AE80),AC80*AE80,\"\")","v":""}]
[null,null,null,"Complétude du questionnaire du référent","REFCOMP3A","A03R_REFCOMP3A / A03R2_REFCOMP3A",null,5,"livrée systématiquement","dico","","E3ARF_FC_REFCOMP3A","Complétude du questionnaire du référent","","3 ans 5","tél. référent","gestion mère","gestion étude",null,null,null,null,null,null,null,null,null,null,2,null,"",""]
[null,null,null,"Participation du ménage","PARTICIPMEN","A03R_PARTICIPMEN",null,null,"livrée systématiquement","num",null,null,"Participation du ménage"]
[null,null,null,"Type de participation des parents","TYPPARTMEN","A03R_TYPPARTMEN",null,null,"livrée systématiquement","num",null,null,"Type de participation des parents",null,null,null,null,null,null,null,null,null,null,null,0,null,null,null,1]
[null,null,null,"E5A - PARTICIPATION (si variables à 5 ans demandées)",null,null,null,null,null,null,null,null,null,null,null,null,null,null,null,null,null,null,null,null,1,null,null,null,"",null,"",""]
[null,null,null,"participation du ménage","PARTIMEN5A","A05X_PARTIMEN5A",null,null,"livrée systématiquement","dico",null,"PARTIMEN5A","participation du ménage",null,null,null,null,null,null,null,null,null,null,null,null,null,null,null,1,null,"",""]
[null,null,null,"participation du référent","REFCOMP5A","A05X_REFCOMP5A",null,null,"livrée systématiquement","dico",null,"REFCOMP5A","participation du référent",null,null,null,null,null,null,null,null,null,null,null,null,null,null,null,1,null,"",""]
[null,null,null,"participation du cohabitant","COHCOMP5A ","A05X_COHCOMP5A ",null,null,"livrée systématiquement","dico",null,"COHCOMP5A","participation du cohabitant",null,null,null,null,null,null,null,null,null,null,null,null,null,null,null,1,null,"",""]
[null,null,null,"participation du non cohabitant","NCOHCOMP5A ","A05X_NCOHCOMP5A ",null,null,"livrée systématiquement","dico",null,"COHCOMP5A","participation du non cohabitant",null,null,null,null,null,null,null,null,null,null,null,0,null,null,null,1,null,"",""]
[null,null,null,"E5A - PONDÉRATION (si variables à 5 ans demandées)",null,null,null,null,null,null,null,null,null,null,null,null,null,null,null,null,null,null,null,null,1,null,null,null,"",null,"",""]
[null,null,null,"pondération REF enquete 5 ans","PONDREF","A05E_PONDREF",null,null,"livrée systématiquement","num",null,null,"pondération REF enquete 5 ans",null,null,null,null,null,null,null,null,null,null,null,null,null,null,null,1,null,"",""]
[null,null,null,"pondération REF LONGITUDINALE enquete 5 ans","LONGPONDREF","A05E_LONGPONDREF",null,null,"livrée systématiquement","num",null,null,"pondération REF LONGITUDINALE enquete 5 ans",null,null,null,null,null,null,null,null,null,null,null,0,null,null,null,1,null,"",""]
[null,null,null,"E9A - PONDÉRATION (si variables à 9 ans demandées)",null,null,null,null,null,null,null,null,null,null,null,null,null,null,null,null,null,null,null,null,1,null,null,null,"",null,"",""]
[null,null,null,"pondération enquête 9 ans SAPRIS T1","POND_T1","A09R_POND_T1",null,1,"livrée systématiquement","num",null,null,"pondération enquête 9 ans SAPRIS T1",null,null,null,null,null,null,null,null,null,null,null,null,null,null,null,1,null,"",""]
[null,null,null,"pondération enquête 9 ans SAPRIS T2","POND_T2","A09R_POND_T2",null,2,"livrée systématiquement","num",null,null,"pondération enquête 9 ans SAPRIS T2",null,null,null,null,null,null,null,null,null,null,null,null,null,null,null,1,null,"",""]
[null,null,null,"pondération enquête 9 ans SAPRIS T1 ou T2","POND_T1_OU_T2","A09R_POND_T1_OU_T2",null,3,"livrée systématiquement","num",null,null,"pondération enquête 9 ans SAPRIS T1 ou T2",null,null,null,null,null,null,null,null,null,null,null,null,null,null,null,1,null,"",""]
[null,null,null,"pondération enquête 9 ans SAPRIS T1 et T2","POND_T1_ET_T2","A09R_POND_T1_ET_T2",null,4,"livrée systématiquement","num",null,null,"pondération enquête 9 ans SAPRIS T1 et T2",null,null,null,null,null,null,null,null,null,null,null,0,null,null,null,1,null,"",""]
[null,null,null,"E10A - PARTICIPATION (si variables à 10 ans demandées)",null,null,null,null,null,null,null,null,null,null,null,null,null,null,null,null,null,null,null,null,1,null,null,null,"",null,"",""]
[null,null,null,"participation et complétude au CATI ref2","REF2COMP10A_CATI","A010X_REF2COMP10A_CATI",null,null,"livrée systématiquement","num",null,null,"participation et complétude au CATI ref2",null,null,null,null,null,null,null,null,null,null,null,null,null,null,null,1,null,"",""]
[null,null,null,"participation et complétude au CATI ref1","REFCOMP10A_CATI","A010X_REFCOMP10A_CATI",null,null,"livrée systématiquement","num",null,null,"participation et complétude au CATI ref1",null,null,null,null,null,null,null,null,null,null,null,null,null,null,null,1,null,"",""]
[null,null,null,"participation du ménage au CAPI","PARTIMEN10A_CAPI","A10X_PARTIMEN10A_CAPI",null,null,"livrée systématiquement","texte",null,null,"participation du ménage au CAPI",null,null,null,null,null,null,null,null,null,null,null,null,null,null,null,1,null,"",""]
[null,null,null,"participation du ménage au CATI","PARTIMEN10A_CATI","A10X_PARTIMEN10A_CATI",null,null,"livrée systématiquement","texte",null,null,"participation du ménage au CATI",null,null,null,null,null,null,null,null,null,null,null,null,null,null,null,1,null,"",""]
[null,null,null,"cause de la non-participation","PQ_PARTIMEN10A","A10X_PQ_PARTIMEN10A",null,null,"livrée systématiquement","texte",null,null,"cause de la non-participation",null,null,null,null,null,null,null,null,null,null,null,0,null,null,null,1,null,"",""]
[null,null,null,"E10A - PONDÉRATION (si variables à 10 ans demandées)",null,null,null,null,null,null,null,null,null,null,null,null,null,null,null,null,null,null,null,null,1,null,null,null,"",null,"",""]
[null,null,null,"pondération enquete 10 ans CAPI (bases ELFE)","PONDREF_CAPI","A10E_PONDREF_CAPI",null,null,"livrée systématiquement","num",null,null,"pondération enquete 10 ans CAPI (bases ELFE)",null,null,null,null,null,null,null,null,null,null,null,null,null,null,null,1,null,"",""]
[null,null,null,"pondération enquete 10 ans CATI (bases ELFE)","PONDREF_CATI","A10E_PONDREF_CATI",null,null,"livrée systématiquement","num",null,null,"pondération enquete 10 ans CATI (bases ELFE)",null,null,null,null,null,null,null,null,null,null,null,0,null,null,null,1,null,"",""]

{"sheet":"E4A_PMI","index":4,"n_rows":203,"n_cols":74,"rows_kept":203,"cut":false,"hidden":false,"merged":[]}
["SELECTION\n(par variable ou par section)","SELECTION\n(par thème 1)","SELECTION\n(par QUEST STANDARD)","LABEL","QUESTION QUESTIONNAIRE","QUESTION BASE","QUESTION BASE",null,"TYPE","FORMAT","CHAPEAU","DICO","DESCRIPTION","CONTRÔLE","THEME(01)","THEME(02)","THEME(03)","THEME1","THEME2","THEME3","THEME4","THEME5","THEME6","QUEST STANDARD","THEME_TITRE",null,"","","","","","","","","","","","","","","","","","","","","","","","","","E4A_PMI","E4A_PMI","","","","","","","","","","","","","","","","","","","","",""]
[null,null,null,{"$f":"CONCATENATE(\"Sélection totale : \",COUNTIFS(A:A,\"X\",I:I,\"*\")+COUNTIFS(B:B,\"X\",I:I,\"*\")+COUNTIFS(C:C,\"X\",I:I,\"*\"),\" variable(s)\")","v":"Sélection totale : 0 variable(s)"},null,null,null,null,null,null,null,null,null,null,null,null,null,null,null,null,null,null,null,null,null,null,{"$f":"COUNTIFS(A:A,\"X\",I:I,\"non-disponible\")+COUNTIFS(B:B,\"X\",I:I,\"non-disponible\")+COUNTIFS(C:C,\"X\",I:I,\"non-disponible\")","v":0},{"$f":"SUM(COUNTIFS($A:$A,\"X\",$E:$E,{\"ACRELI\";\"ACCHRET\";\"ACMUSUL\";\"LRELI\";\"QLCHRET\";\"QLMUSUL\";\"POLIT\"})+COUNTIFS($B:$B,\"X\",$E:$E,{\"ACRELI\";\"ACCHRET\";\"ACMUSUL\";\"LRELI\";\"QLCHRET\";\"QLMUSUL\";\"POLIT\"})+COUNTIFS($C:$C,\"X\",$E:$E,{\"ACRELI\";\"ACCHRET\";\"ACMUSUL\";\"LRELI\";\"QLCHRET\";\"QLMUSUL\";\"POLIT\"}))","v":0}]
[null,null,null,"GESTION",null,null,null,null,null,null,null,null,null,null,null,null,null,null,null,null,null,null,null,null,1]
[null,null,null,"Présence d'une fiche d'inclusion","I_INC","A04X2_I_INC",null,3,"donnée","dico",null,"E3APMI_YORN",null,null,"medecin",null,null,"Santé enfant","","","","","GESTION",""]
[null,null,null,"Département","I_DEPART","A04X2_I_DEPART",null,4,"non-disponible","num",null,"E3APMI_DEPARTEMENT",null,null,"medecin",null,null,"Santé enfant","","","","","GESTION",""]
[null,null,null,"Région","I_REGION","A04X2_I_REGION",null,5,"donnée","num",null,"E3APMI_REG",null,null,"medecin",null,null,"Santé enfant","","","","","GESTION",""]
[null,null,null,"Prise TA. Marque manometre","I_MANOMETR","A04X2_I_MANOMETR",null,6,"donnée","text",null,"",null,null,"medecin",null,null,"Santé enfant","","","","","GESTION",""]
[null,null,null,"Remarques cahier inclusion","I_REMARQUES","* A04X2_I_REMARQUES",null,7,"non-disponible","text",null,"",null,null,"medecin",null,null,"Santé enfant","","","","","GESTION",""]
[null,null,null,"Poids de naissance","I_POIDSNAISS","A04X2_I_POIDSNAISS",null,8,"donnée","num",null,"",null,null,"medecin",null,null,"Santé enfant","","","","","GESTION",""]
[null,null,null,"Date de naissance mois","I_DATNAISSM","A04X2_I_DATNAISSM",null,9,"donnée","num",null,"",null,null,"medecin",null,null,"Santé enfant","","","","","GESTION",""]
[null,null,null,"Presnce d''un parent","I_PARENT","A04X2_I_PARENT",null,10,"donnée","dico",null,"E3APMI_YORN",null,null,"medecin",null,null,"Santé enfant","","","","","GESTION",""]
[null,null,null,"Statut Elfe","I_ELFE","A04X2_I_ELFE",null,11,"donnée","num",null,"",null,null,"medecin",null,null,"Santé enfant","","","","","GESTION",""]
[null,null,null,"REFUS de participation","I_REFUS","A04X2_I_REFUS",null,12,"donnée","dico",null,"E3APMI_YORN",null,null,"medecin",null,null,"Santé enfant","","","","","GESTION","",0]
[null,null,null,"GÉNÉRALITÉS",null,null,null,null,null,null,null,null,null,null,null,null,null,null,null,null,null,null,null,null,1]
[null,null,null,"Sexe de l'enfant","SEXE","A04X2_SEXE",null,13,"donnée","dico",null,"E3APMI_SEXE",null,null,"medecin",null,null,"Santé enfant","","","","","GÉNÉRALITÉS",""]
[null,null,null,"Date de l'examen: jour","DATEXAMJ","A04X2_DATEXAMJ",null,14,"donnée","num",null,"",null,null,"medecin",null,null,"Santé enfant","","","","","GÉNÉRALITÉS",""]
[null,null,null,"Date de l'examen: mois","DATEXAMM","A04X2_DATEXAMM",null,15,"donnée","num",null,"",null,null,"medecin",null,null,"Santé enfant","","","","","GÉNÉRALITÉS",""]
[null,null,null,"Date de l'examen: année","DATEXAMA","A04X2_DATEXAMA",null,16,"donnée","num",null,"",null,null,"medecin",null,null,"Santé enfant","","","","","GÉNÉRALITÉS",""]
[null,null,null,"Age de l'enfant à l'examen général (Mois)","AGEMEXAM","A04X2_AGEMEXAM",null,17,"donnée","num",null,"",null,null,"medecin",null,null,"Santé enfant","","","","","GÉNÉRALITÉS",""]
[null,null,null,"Age examen vue","AGEMVUE","A04X2_AGEMVUE",null,18,"donnée","num",null,"",null,null,"medecin",null,null,"Santé enfant","Vision","","","","GÉNÉRALITÉS",""]
[null,null,null,"Age examen auditif","AGEMAUD","A04X2_AGEMAUD",null,19,"donnée","num",null,"",null,null,"medecin",null,null,"Santé enfant","Audition","","","","GÉNÉRALITÉS",""]
[null,null,null,"Age examen dentaire","AGEMDENT","A04X2_AGEMDENT",null,20,"donnée","num",null,"",null,null,"medecin",null,null,"Santé enfant","Dentaire","","","","GÉNÉRALITÉS",""]
[null,null,null,"Age examen langage","AGEMLANG","A04X2_AGEMLANG",null,21,"donnée","num",null,"",null,null,"medecin",null,null,"Santé enfant","","","","","GÉNÉRALITÉS",""]
[null,null,null,"Ecole publique/privée","SECTPUPRI","A04X2_SECTPUPRI",null,22,"donnée","num",null,"",null,null,"medecin",null,null,"Santé enfant","Mode de garde, scolarisation","","","","GÉNÉRALITÉS",""]
[null,null,null,"Eduation prioritaire","EDUC_PRIORITAIRE","A04X2_EDUC_PRIORITAIRE",null,23,"donnée","num",null,"",null,null,"medecin",null,null,"Santé enfant","Mode de garde, scolarisation","","","","GÉNÉRALITÉS",""]
[null,null,null,"Scolarisation en ZEP, REP ou RRS","ZEPREP","A04X2_ZEPREP",null,24,"donnée","dico",null,"E3APMI_FORMAT2P",null,null,"medecin",null,null,"Santé enfant","Mode de garde, scolarisation","","","","GÉNÉRALITÉS",""]
[null,null,null,"Classe","CLASSE","A04X2_CLASSE",null,25,"donnée","dico",null,"E3APMI_FORMAT3P",null,null,"medecin",null,null,"Santé enfant","Mode de garde, scolarisation","","","","GÉNÉRALITÉS",""]
[null,null,null,"Effectif","EFFECTIF","A04X2_EFFECTIF",null,26,"donnée","dico",null,"E3APMI_FORMAT4P",null,null,"medecin",null,null,"Santé enfant","Mode de garde, scolarisation","","","","GÉNÉRALITÉS",""]
[null,null,null,"Commentaire intrus inscrit dans la partie Généralités","COMMGEN","* A04X2_COMMGEN",null,27,"non-disponible","text",null,"",null,null,"medecin",null,null,"Santé enfant","","","","","GÉNÉRALITÉS","",0]
[null,null,null,"FAMILLE",null,null,null,null,null,null,null,null,null,null,null,null,null,null,null,null,null,null,null,null,1]
[null,null,null," Vit avec","VITAVEC","A04X2_VITAVEC",null,28,"donnée","dico",null,"E3APMI_FORMAT5P",null,null,"medecin",null,null,"Santé enfant","Couple, famille","","","","FAMILLE",""]
[null,null,null,"Profession de la mère","PROFMERE","A04X2_PROFMERE",null,29,"donnée","dico",null,"E3APMI_FORMAT6P",null,null,"medecin",null,null,"Santé enfant","Couple, famille","","","","FAMILLE",""]
[null,null,null,"Profession du père","PROFPERE","A04X2_PROFPERE",null,30,"donnée","dico",null,"E3APMI_FORMAT6P",null,null,"medecin",null,null,"Santé enfant","Couple, famille","","","","FAMILLE",""]
[null,null,null,"Activité de la mère","ACTIMERE","A04X2_ACTIMERE",null,31,"donnée","dico",null,"E3APMI_FORMAT7P",null,null,"medecin",null,null,"Santé enfant","Couple, famille","","","","FAMILLE",""]
[null,null,null,"Activité du père","ACTIPERE","A04X2_ACTIPERE",null,32,"donnée","dico",null,"E3APMI_FORMAT7P",null,null,"medecin",null,null,"Santé enfant","Couple, famille","","","","FAMILLE",""]
[null,null,null,"Commentaire intrus inscrit dans la partie Famille","COMMFAM","* A04X2_COMMFAM",null,33,"non-disponible","text",null,"",null,null,"medecin",null,null,"Santé enfant","Couple, famille","","","","FAMILLE","",0]
[null,null,null,"RÉALISATION",null,null,null,null,null,null,null,null,null,null,null,null,null,null,null,null,null,null,null,null,1]
[null,null,null,"Systématique","SYSTEMAT","A04X2_SYSTEMAT",null,34,"donnée","dico",null,"E3APMI_FORMAT8P",null,null,"medecin",null,null,"Santé enfant","","","","","RÉALISATION",""]
[null,null,null,"Ciblé","CIBLE","A04X2_CIBLE",null,35,"donnée","dico",null,"E3APMI_FORMAT8P",null,null,"medecin",null,null,"Santé enfant","","","","","RÉALISATION",""]
[null,null,null,"Ciblé Elfe","CIBLELFE","A04X2_CIBLELFE",null,36,"donnée","dico",null,"E3APMI_FORMAT8P",null,null,"medecin",null,null,"Santé enfant","","","","","RÉALISATION",""]
[null,null,null,"Ciblé PMI","CIBLEPMI","A04X2_CIBLEPMI",null,37,"donnée","dico",null,"E3APMI_FORMAT8P",null,null,"medecin",null,null,"Santé enfant","","","","","RÉALISATION",""]
[null,null,null,"Médecin de PMI","MEDPMI","A04X2_MEDPMI",null,38,"donnée","dico",null,"E3APMI_FORMAT8P",null,null,"medecin",null,null,"Santé enfant","","","","","RÉALISATION",""]
[null,null,null,"Médecin libéral","MEDLIBER","A04X2_MEDLIBER",null,39,"donnée","dico",null,"E3APMI_FORMAT8P",null,null,"medecin",null,null,"Santé enfant","","","","","RÉALISATION",""]
[null,null,null,"médecin scolaire","MEDSCOL","A04X2_MEDSCOL",null,40,"donnée","dico",null,"E3APMI_FORMAT8P",null,null,"medecin",null,null,"Santé enfant","","","","","RÉALISATION",""]
[null,null,null,"Infirmière scolaire","INFSCOL","A04X2_INFSCOL",null,41,"donnée","dico",null,"E3APMI_FORMAT8P",null,null,"medecin",null,null,"Santé enfant","","","","","RÉALISATION",""]
[null,null,null,"Auxiliaire de PMI","AUXPMI","A04X2_AUXPMI",null,42,"donnée","dico",null,"E3APMI_FORMAT8P",null,null,"medecin",null,null,"Santé enfant","","","","","RÉALISATION",""]
[null,null,null,"infirmière ou puericultrice de PMI","INFPUERPMI","A04X2_INFPUERPMI",null,43,"donnée","dico",null,"E3APMI_FORMAT8P",null,null,"medecin",null,null,"Santé enfant","","","","","RÉALISATION",""]
[null,null,null,"Autre professionel","AUTRPROF","A04X2_AUTRPROF",null,44,"donnée","dico",null,"E3APMI_FORMAT8P",null,null,"medecin",null,null,"Santé enfant","","","","","RÉALISATION",""]
[null,null,null,"Autre professionel: precisez","AUTRPROFP","* A04X2_AUTRPROFP",null,45,"non-disponible","text",null,"",null,null,"medecin",null,null,"Santé enfant","","","","","RÉALISATION",""]
[null,null,null,"Commentaire intrus inscrit dans la partie Réalisation","COMMREA","* A04X2_COMMREA",null,46,"non-disponible","text",null,"",null,null,"medecin",null,null,"Santé enfant","","","","","RÉALISATION","",0]
[null,null,null,"DISPOSITIFS PARTICULIERS D’ACCUEIL MIS EN PLACE A L’ECOLE",null,null,null,null,null,null,null,null,null,null,null,null,null,null,null,null,null,null,null,null,1]
[null,"",null,"PPS","PPS","A04X2_PPS",null,47,"donnée","dico",null,"E3APMI_FORMAT9P",null,null,"medecin",null,null,"Ecole","Santé enfant","Mode de garde, scolarisation","","","DISPOSITIFS PARTICULIERS D’ACCUEIL MIS EN PLACE A L’ECOLE",""]
[null,"",null,"AEEH connue","AEEH","A04X2_AEEH",null,48,"donnée","dico",null,"E3APMI_FORMAT8P",null,null,"medecin",null,null,"Ecole","Santé enfant","Mode de garde, scolarisation","","","DISPOSITIFS PARTICULIERS D’ACCUEIL MIS EN PLACE A L’ECOLE",""]
[null,"",null,"Aménagement du temps scolaire de l'enfant","AMENAGTEMPS","A04X2_AMENAGTEMPS",null,49,"donnée","dico",null,"E3APMI_FORMAT8P",null,null,"medecin",null,null,"Ecole","Santé enfant","Mode de garde, scolarisation","","","DISPOSITIFS PARTICULIERS D’ACCUEIL MIS EN PLACE A L’ECOLE",""]
[null,"",null,"Présence d'un AVS ou EVS","AVS","A04X2_AVS",null,50,"donnée","dico",null,"E3APMI_FORMAT8P",null,null,"medecin",null,null,"Ecole","Santé enfant","Mode de garde, scolarisation","","","DISPOSITIFS PARTICULIERS D’ACCUEIL MIS EN PLACE A L’ECOLE",""]
[null,"",null,"% ETP","ETPAVS","A04X2_ETPAVS",null,51,"donnée","num",null,"",null,null,"medecin",null,null,"Ecole","Santé enfant","Mode de garde, scolarisation","","","DISPOSITIFS PARTICULIERS D’ACCUEIL MIS EN PLACE A L’ECOLE",""]
[null,"",null,"PAI","PAI","A04X2_PAI",null,52,"donnée","dico",null,"E3APMI_FORMAT11P",null,null,"medecin",null,null,"Ecole","Santé enfant","Mode de garde, scolarisation","","","DISPOSITIFS PARTICULIERS D’ACCUEIL MIS EN PLACE A L’ECOLE",""]
[null,"",null,"PAI pour allergie alimentaire","PAIALLERG","A04X2_PAIALLERG",null,53,"donnée","dico",null,"E3APMI_FORMAT8P",null,null,"medecin",null,null,"Ecole","Santé enfant","Mode de garde, scolarisation","","","DISPOSITIFS PARTICULIERS D’ACCUEIL MIS EN PLACE A L’ECOLE",""]
[null,"",null,"PAI pour asthme","PAIASTHME","A04X2_PAIASTHME",null,54,"donnée","dico",null,"E3APMI_FORMAT8P",null,null,"medecin",null,null,"Ecole","Santé enfant","Mode de garde, scolarisation","","","DISPOSITIFS PARTICULIERS D’ACCUEIL MIS EN PLACE A L’ECOLE",""]
[null,"",null,"PAI autre","PAIAUTRE","A04X2_PAIAUTRE",null,55,"donnée","dico",null,"E3APMI_FORMAT8P",null,null,"medecin",null,null,"Ecole","Santé enfant","Mode de garde, scolarisation","","","DISPOSITIFS PARTICULIERS D’ACCUEIL MIS EN PLACE A L’ECOLE",""]
[null,"",null,"Précision après\"autre\"","PAIPP","* A04X2_PAIPP",null,56,"non-disponible","text",null,"",null,null,"medecin",null,null,"Ecole","Santé enfant","Mode de garde, scolarisation","","","DISPOSITIFS PARTICULIERS D’ACCUEIL MIS EN PLACE A L’ECOLE",""]
[null,"",null,"Commentaire intrus inscrit dans la partie Dispositifs","COMMDISPO","* A04X2_COMMDISPO",null,57,"non-disponible","text",null,"",null,null,"medecin",null,null,"Ecole","Santé enfant","Mode de garde, scolarisation","","","DISPOSITIFS PARTICULIERS D’ACCUEIL MIS EN PLACE A L’ECOLE","",0]
[null,null,null,"VACCINATIONS",null,null,null,null,null,null,null,null,null,null,null,null,null,null,null,null,null,null,null,null,1]
[null,null,null,"Terme","TERME","A04X2_TERME",null,58,"donnée","num",null,"",null,null,"medecin",null,null,"Santé enfant","","","","","VACCINATIONS",""]
[null,null,null,"Nombre d'hospitalisations y compris néonatales et de jour","NBHOSP","A04X2_NBHOSP",null,59,"donnée","num",null,"",null,null,"medecin",null,null,"Santé enfant","Recours aux soins","","","","VACCINATIONS",""]
[null,null,null,"Commentaire intrus inscrit dans la partie ATCD (antécédents)","COMMATCD","* A04X2_COMMATCD",null,60,"non-disponible","text",null,"",null,null,"medecin",null,null,"Santé enfant","","","","","VACCINATIONS",""]
[null,null,null,"DT polio 1ère dose","DTPOLIO1","A04X2_DTPOLIO1",null,61,"donnée","dico",null,"E3APMI_FORMAT8P",null,null,"medecin",null,null,"Santé enfant","Recours aux soins","","","","VACCINATIONS",""]
[null,null,null,"DT polio 2ème dose","DTPOLIO2","A04X2_DTPOLIO2",null,62,"donnée","dico",null,"E3APMI_FORMAT8P",null,null,"medecin",null,null,"Santé enfant","Recours aux soins","","","","VACCINATIONS",""]
[null,null,null,"DT polio 3ème dose","DTPOLIO3","A04X2_DTPOLIO3",null,63,"donnée","dico",null,"E3APMI_FORMAT8P",null,null,"medecin",null,null,"Santé enfant","Recours aux soins","","","","VACCINATIONS",""]
[null,null,null,"DT polio rappel","DTPOLIORAP","A04X2_DTPOLIORAP",null,64,"donnée","dico",null,"E3APMI_FORMAT8P",null,null,"medecin",null,null,"Santé enfant","Recours aux soins","","","","VACCINATIONS",""]
[null,null,null,"Coqueluche 1ère dose","COQUELU1","A04X2_COQUELU1",null,65,"donnée","dico",null,"E3APMI_FORMAT8P",null,null,"medecin",null,null,"Santé enfant","Recours aux soins","","","","VACCINATIONS",""]
[null,null,null,"Coqueluche 2ème dose","COQUELU2","A04X2_COQUELU2",null,66,"donnée","dico",null,"E3APMI_FORMAT8P",null,null,"medecin",null,null,"Santé enfant","Recours aux soins","","","","VACCINATIONS",""]
[null,null,null,"Coqueluche 3ème dose","COQUELU3","A04X2_COQUELU3",null,67,"donnée","dico",null,"E3APMI_FORMAT8P",null,null,"medecin",null,null,"Santé enfant","Recours aux soins","","","","VACCINATIONS",""]
[null,null,null,"Coqueluche dose de rappel","COQUELURAP","A04X2_COQUELURAP",null,68,"donnée","dico",null,"E3APMI_FORMAT8P",null,null,"medecin",null,null,"Santé enfant","Recours aux soins","","","","VACCINATIONS",""]
[null,null,null,"Haemophilus Influenzae 1ère dose","HAEMO1","A04X2_HAEMO1",null,69,"donnée","dico",null,"E3APMI_FORMAT8P",null,null,"medecin",null,null,"Santé enfant","Recours aux soins","","","","VACCINATIONS",""]
[null,null,null,"Haemophilus Influenzae 2ème dose","HAEMO2","A04X2_HAEMO2",null,70,"donnée","dico",null,"E3APMI_FORMAT8P",null,null,"medecin",null,null,"Santé enfant","Recours aux soins","","","","VACCINATIONS",""]
[null,null,null,"Haemophilus Influenzae 3ème dose","HAEMO3","A04X2_HAEMO3",null,71,"donnée","dico",null,"E3APMI_FORMAT8P",null,null,"medecin",null,null,"Santé enfant","Recours aux soins","","","","VACCINATIONS",""]
[null,null,null,"Haemophilus Influenzae rappel","HAEMORAP","A04X2_HAEMORAP",null,72,"donnée","dico",null,"E3APMI_FORMAT8P",null,null,"medecin",null,null,"Santé enfant","Recours aux soins","","","","VACCINATIONS",""]
[null,null,null,"Hepatite B 1ère dose","HEPATB1","A04X2_HEPATB1",null,73,"donnée","dico",null,"E3APMI_FORMAT8P",null,null,"medecin",null,null,"Santé enfant","Recours aux soins","","","","VACCINATIONS",""]
[null,null,null,"Hepatite B 2ème dose","HEPATB2","A04X2_HEPATB2",null,74,"donnée","dico",null,"E3APMI_FORMAT8P",null,null,"medecin",null,null,"Santé enfant","Recours aux soins","","","","VACCINATIONS",""]
[null,null,null,"Hepatite B 3ème dose","HEPATB3","A04X2_HEPATB3",null,75,"donnée","dico",null,"E3APMI_FORMAT8P",null,null,"medecin",null,null,"Santé enfant","Recours aux soins","","","","VACCINATIONS",""]
[null,null,null,"Hepatite B rappel","HEPATBRAP","A04X2_HEPATBRAP",null,76,"donnée","dico",null,"E3APMI_FORMAT8P",null,null,"medecin",null,null,"Santé enfant","Recours aux soins","","","","VACCINATIONS",""]
[null,null,null,"Pneumocoque 1ère dose","PNEUMO1","A04X2_PNEUMO1",null,77,"donnée","dico",null,"E3APMI_FORMAT8P",null,null,"medecin",null,null,"Santé enfant","Recours aux soins","","","","VACCINATIONS",""]
[null,null,null,"Pneumocoque 2ème dose","PNEUMO2","A04X2_PNEUMO2",null,78,"donnée","dico",null,"E3APMI_FORMAT8P",null,null,"medecin",null,null,"Santé enfant","Recours aux soins","","","","VACCINATIONS",""]
[null,null,null,"Pneumocoque 3ème dose","PNEUMO3","A04X2_PNEUMO3",null,79,"donnée","dico",null,"E3APMI_FORMAT8P",null,null,"medecin",null,null,"Santé enfant","Recours aux soins","","","","VACCINATIONS",""]
[null,null,null," Pneumocoque rappel","PNEUMORAP","A04X2_PNEUMORAP",null,80,"donnée","dico",null,"E3APMI_FORMAT8P",null,null,"medecin",null,null,"Santé enfant","Recours aux soins","","","","VACCINATIONS",""]
[null,null,null,"BCG","BCG","A04X2_BCG",null,81,"donnée","dico",null,"E3APMI_FORMAT11P",null,null,"medecin",null,null,"Santé enfant","Recours aux soins","","","","VACCINATIONS",""]
[null,null,null,"ROR 1ère dose","ROR1","A04X2_ROR1",null,82,"donnée","dico",null,"E3APMI_FORMAT8P",null,null,"medecin",null,null,"Santé enfant","Recours aux soins","","","","VACCINATIONS",""]
[null,null,null,"ROR 2ème dose","ROR2","A04X2_ROR2",null,83,"donnée","dico",null,"E3APMI_FORMAT8P",null,null,"medecin",null,null,"Santé enfant","Recours aux soins","","","","VACCINATIONS",""]
[null,null,null,"Méningocoque C","MENINGOC","A04X2_MENINGOC",null,84,"donnée","dico",null,"E3APMI_FORMAT11P",null,null,"medecin",null,null,"Santé enfant","Recours aux soins","","","","VACCINATIONS",""]
[null,null,null,"Hepatite A 1ère dose","HEPATA1","A04X2_HEPATA1",null,85,"donnée","dico",null,"E3APMI_FORMAT8P",null,null,"medecin",null,null,"Santé enfant","Recours aux soins","","","","VACCINATIONS",""]
[null,null,null,"Hepatite A 2ème dose","HEPATA2","A04X2_HEPATA2",null,86,"donnée","dico",null,"E3APMI_FORMAT8P",null,null,"medecin",null,null,"Santé enfant","Recours aux soins","","","","VACCINATIONS",""]
[null,null,null,"Fièvre jaune","FIEVREJAUNE","A04X2_FIEVREJAUNE",null,87,"donnée","dico",null,"E3APMI_FORMAT8P",null,null,"medecin",null,null,"Santé enfant","Recours aux soins","","","","VACCINATIONS",""]
[null,null,null,"Varicelle 1ère dose","VARICELLE1","A04X2_VARICELLE1",null,88,"donnée","dico",null,"E3APMI_FORMAT8P",null,null,"medecin",null,null,"Santé enfant","Recours aux soins","","","","VACCINATIONS",""]
[null,null,null,"Varicelle 2ème dose","VARICELLE2","A04X2_VARICELLE2",null,89,"donnée","dico",null,"E3APMI_FORMAT8P",null,null,"medecin",null,null,"Santé enfant","Recours aux soins","","","","VACCINATIONS",""]
[null,null,null,"Grippe (année 2011)","GRIPPE2011","A04X2_GRIPPE2011",null,90,"donnée","dico",null,"E3APMI_FORMAT8P",null,null,"medecin",null,null,"Santé enfant","Recours aux soins","","","","VACCINATIONS",""]
[null,null,null,"Grippe (année 2012)","GRIPPE2012","A04X2_GRIPPE2012",null,91,"donnée","dico",null,"E3APMI_FORMAT8P",null,null,"medecin",null,null,"Santé enfant","Recours aux soins","","","","VACCINATIONS",""]
[null,null,null,"Grippe (année 2013)","GRIPPE2013","A04X2_GRIPPE2013",null,92,"donnée","dico",null,"E3APMI_FORMAT8P",null,null,"medecin",null,null,"Santé enfant","Recours aux soins","","","","VACCINATIONS",""]
[null,null,null,"Grippe (année 2014)","GRIPPE2014","A04X2_GRIPPE2014",null,93,"donnée","dico",null,"E3APMI_FORMAT8P",null,null,"medecin",null,null,"Santé enfant","Recours aux soins","","","","VACCINATIONS",""]
[null,null,null,"Grippe (année 2015)","GRIPPE2015","A04X2_GRIPPE2015",null,94,"donnée","dico",null,"E3APMI_FORMAT8P",null,null,"medecin",null,null,"Santé enfant","Recours aux soins","","","","VACCINATIONS",""]
[null,null,null,"Rotavirus","ROTAVIRUS","A04X2_ROTAVIRUS",null,95,"donnée","dico",null,"E3APMI_FORMAT12P",null,null,"medecin",null,null,"Santé enfant","Recours aux soins","","","","VACCINATIONS",""]
[null,null,null,"Autre","AUTREVACC","A04X2_AUTREVACC",null,96,"donnée","dico",null,"E3APMI_FORMAT13P",null,null,"medecin",null,null,"Santé enfant","Recours aux soins","","","","VACCINATIONS",""]
[null,null,null,"Autre (chapitre vacinations)","AUTREVACCP","* A04X2_AUTREVACCP",null,97,"non-disponible","text",null,"",null,null,"medecin",null,null,"Santé enfant","Recours aux soins","","","","VACCINATIONS",""]
[null,null,null,"Carnet de santé ou de vaccination non présenté","CARNETSANT","A04X2_CARNETSANT",null,98,"donnée","dico",null,"E3APMI_FORMAT8P",null,null,"medecin",null,null,"Santé enfant","Recours aux soins","","","","VACCINATIONS",""]
[null,null,null,"Commentaire intrus inscrit dans la partie Vaccinations","COMMVACC","A04X2_COMMVACC",null,99,"donnée","text",null,"",null,null,"medecin",null,null,"Santé enfant","Recours aux soins","","","","VACCINATIONS","",0]
[null,null,null,"EXAMEN CLINIQUE GÉNÉRAL",null,null,null,null,null,null,null,null,null,null,null,null,null,null,null,null,null,null,null,null,1]
[null,null,null,"Poids (kg)","POIDS","A04X2_POIDS",null,100,"donnée","num",null,"",null,null,"medecin",null,null,"Santé enfant","Anthropométrie","","","","EXAMEN CLINIQUE GÉNÉRAL",""]
[null,null,null,"Taille (cm)","TAILLE","A04X2_TAILLE",null,101,"donnée","num",null,"",null,null,"medecin",null,null,"Santé enfant","Anthropométrie","","","","EXAMEN CLINIQUE GÉNÉRAL",""]
[null,null,null,"PA systolique","PASYST1","A04X2_PASYST1",null,102,"donnée","text",null,"",null,null,"medecin",null,null,"Santé enfant","","","","","EXAMEN CLINIQUE GÉNÉRAL",""]
[null,null,null,"PA diastolique","PADIAST1","A04X2_PADIAST1",null,103,"donnée","text",null,"",null,null,"medecin",null,null,"Santé enfant","","","","","EXAMEN CLINIQUE GÉNÉRAL",""]
[null,null,null,"PA systolique","PASYST2","A04X2_PASYST2",null,104,"donnée","text",null,"",null,null,"medecin",null,null,"Santé enfant","","","","","EXAMEN CLINIQUE GÉNÉRAL",""]
[null,null,null,"PA diastolique","PADIAST2","A04X2_PADIAST2",null,105,"donnée","text",null,"",null,null,"medecin",null,null,"Santé enfant","","","","","EXAMEN CLINIQUE GÉNÉRAL",""]
[null,null,null,"Rebond IMC","REBIMC","A04X2_REBIMC",null,106,"donnée","dico",null,"E3APMI_FORMAT14P",null,null,"medecin",null,null,"Santé enfant","","","","","EXAMEN CLINIQUE GÉNÉRAL",""]
[null,null,null,"Protéinurie","PROTEINURIE","A04X2_PROTEINURIE",null,107,"donnée","dico",null,"E3APMI_FORMAT15P",null,null,"medecin",null,null,"Santé enfant","","","","","EXAMEN CLINIQUE GÉNÉRAL",""]
[null,null,null,"Prémature thélarche","THELARCH","A04X2_THELARCH",null,108,"donnée","dico",null,"E3APMI_FORMAT16P",null,null,"medecin",null,null,"Santé enfant","","","","","EXAMEN CLINIQUE GÉNÉRAL",""]
[null,null,null,"Cryptorchidie","CRYPTORCH","A04X2_CRYPTORCH",null,109,"donnée","dico",null,"E3APMI_FORMAT16P",null,null,"medecin",null,null,"Santé enfant","","","","","EXAMEN CLINIQUE GÉNÉRAL",""]
[null,null,null,"Indicateur IMC","IMC","SYN_IMC",null,189,"donnée","dico",null,"E3APMI_IMC",null,null,"medecin",null,null,"Santé enfant","Anthropométrie","","","","EXAMEN CLINIQUE GÉNÉRAL",""]
[null,null,null,"Autre anomalie non prise en charge retrouvée à l'examen clinique","ANOMCLIN","A04X2_ANOMCLIN",null,110,"donnée","dico",null,"E3APMI_FORMAT17P",null,null,"medecin",null,null,"Santé enfant","","","","","EXAMEN CLINIQUE GÉNÉRAL",""]
[null,null,null,"Commentaire intrus inscrit dans la partie Clinique","COMMCLIN","A04X2_COMMCLIN",null,111,"donnée","text",null,"",null,null,"medecin",null,null,"Santé enfant","","","","","EXAMEN CLINIQUE GÉNÉRAL","",0]
[null,null,null,"EXAMEN AUDITIF",null,null,null,null,null,null,null,null,null,null,null,null,null,null,null,null,null,null,null,null,1]
[null,null,null,"Audition normale à droite","AUDITIOND","A04X2_AUDITIOND",null,112,"donnée","dico",null,"E3APMI_FORMAT18P",null,null,"medecin",null,null,"Santé enfant","Audition","","","","EXAMEN AUDITIF",""]
[null,null,null,"Audition normale à gauche","AUDITIONG","A04X2_AUDITIONG",null,113,"donnée","dico",null,"E3APMI_FORMAT18P",null,null,"medecin",null,null,"Santé enfant","Audition","","","","EXAMEN AUDITIF",""]
[null,null,null,"Test de l'audition utilisé: voix chochotée","VOIXCHUCH","A04X2_VOIXCHUCH",null,114,"donnée","dico",null,"E3APMI_FORMAT8P",null,null,"medecin",null,null,"Santé enfant","Audition","","","","EXAMEN AUDITIF",""]
[null,null,null,"Test de l'audition utilisé: audiotesteur","AUDIOTEST","A04X2_AUDIOTEST",null,115,"donnée","dico",null,"E3APMI_FORMAT8P",null,null,"medecin",null,null,"Santé enfant","Audition","","","","EXAMEN AUDITIF",""]
[null,null,null,"Test de l'audition utilisé: autre test","AUTRTESTAUD","A04X2_AUTRTESTAUD",null,116,"donnée","dico",null,"E3APMI_FORMAT8P",null,null,"medecin",null,null,"Santé enfant","Audition","","","","EXAMEN AUDITIF",""]
[null,null,null,"Autres test (chapitre audition)","AUTRTESTAUDP","A04X2_AUTRTESTAUDP",null,117,"donnée","text",null,"",null,null,"medecin",null,null,"Santé enfant","Audition","","","","EXAMEN AUDITIF",""]
[null,null,null,"Commentaire intrus inscrit dans la partie Audition","COMMAUD","A04X2_COMMAUD",null,118,"donnée","text",null,"",null,null,"medecin",null,null,"Santé enfant","Audition","","","","EXAMEN AUDITIF","",0]
[null,null,null,"EXAMEN DE LA VUE",null,null,null,null,null,null,null,null,null,null,null,null,null,null,null,null,null,null,null,null,1]
[null,null,null,"Lunettes","LUNETTES","A04X2_LUNETTES",null,119,"donnée","dico",null,"E3APMI_FORMAT11P",null,null,"medecin",null,null,"Santé enfant","Vision","","","","EXAMEN DE LA VUE",""]
[null,null,null,"Cache occlusif permanent ou ponctuel","CACHE","A04X2_CACHE",null,120,"donnée","dico",null,"E3APMI_FORMAT11P",null,null,"medecin",null,null,"Santé enfant","Vision","","","","EXAMEN DE LA VUE",""]
[null,null,null,"Strabisme","STRABISME","A04X2_STRABISME",null,121,"donnée","dico",null,"E3APMI_FORMAT11P",null,null,"medecin",null,null,"Santé enfant","Vision","","","","EXAMEN DE LA VUE",""]
[null,null,null,"Si strabisme, précision œil droit","STRABDROIT","A04X2_STRABDROIT",null,122,"donnée","dico",null,"E3APMI_FORMAT8P",null,null,"medecin",null,null,"Santé enfant","Vision","","","","EXAMEN DE LA VUE",""]
[null,null,null,"Si strabisme, précision œil gauche","STRABGAUCHE","A04X2_STRABGAUCHE",null,123,"donnée","dico",null,"E3APMI_FORMAT8P",null,null,"medecin",null,null,"Santé enfant","Vision","","","","EXAMEN DE LA VUE",""]
[null,null,null,"Autre anomalie visuelle","AUTRANOVUE","A04X2_AUTRANOVUE",null,124,"donnée","dico",null,"E3APMI_FORMAT11P",null,null,"medecin",null,null,"Santé enfant","Vision","","","","EXAMEN DE LA VUE",""]
[null,null,null,"Autre anomalie visuelle","AUTRANOVUEP","A04X2_AUTRANOVUEP",null,125,"donnée","text",null,"",null,null,"medecin",null,null,"Santé enfant","Vision","","","","EXAMEN DE LA VUE",""]
[null,null,null,"Acuité visuelle de loin de l'œil droit sans lunettes","ACUVUED","A04X2_ACUVUED",null,126,"donnée","num",null,"",null,null,"medecin",null,null,"Santé enfant","Vision","","","","EXAMEN DE LA VUE",""]
[null,null,null,"Acuité visuelle de loin de l'œil gauche sans lunettes","ACUVUEG","A04X2_ACUVUEG",null,127,"donnée","num",null,"",null,null,"medecin",null,null,"Santé enfant","Vision","","","","EXAMEN DE LA VUE",""]
[null,null,null,"Acuité visuelle de loin de l'œil droit avec lunettes","ACUVUELUND","A04X2_ACUVUELUND",null,128,"donnée","num",null,"",null,null,"medecin",null,null,"Santé enfant","Vision","","","","EXAMEN DE LA VUE",""]
[null,null,null,"Acuité visuelle de loin de l'œil gauche avec lunettes","ACUVUELUNG","A04X2_ACUVUELUNG",null,129,"donnée","num",null,"",null,null,"medecin",null,null,"Santé enfant","Vision","","","","EXAMEN DE LA VUE",""]
[null,null,null,"Aucun test de vue","AUCUNVUE","A04X2_AUCUNVUE",null,135,"donnée","dico",null,"E3APMI_FORMAT8P",null,null,"medecin",null,null,"Santé enfant","Vision","","","","EXAMEN DE LA VUE",""]
[null,null,null,"Refus test acuité visuel","REFUSVUE","A04X2_REFUSVUE",null,136,"donnée","dico",null,"E3APMI_FORMAT8P",null,null,"medecin",null,null,"Santé enfant","Vision","","","","EXAMEN DE LA VUE",""]
[null,null,null,"Autre test  visuel à préciser","TESTVUEAUTP","A04X2_TESTVUEAUTP",null,138,"donnée","text",null,"",null,null,"medecin",null,null,"Santé enfant","Vision","","","","EXAMEN DE LA VUE",""]
[null,null,null,"Commentaire intrus inscrit dans la partie Vision","COMMVUE","* A04X2_COMMVUE",null,139,"non-disponible","text",null,"",null,null,"medecin",null,null,"Santé enfant","Vision","","","","EXAMEN DE LA VUE",""]
[null,null,null,"Test de Lang","LANG","A04X2_LANG",null,130,"donnée","dico",null,"E3APMI_FORMAT20P",null,null,"medecin",null,null,"Santé enfant","Vision","","","","LANGAGE",""]
[null,null,null,"STYCAR test","STYCAR","A04X2_STYCAR",null,131,"donnée","dico",null,"E3APMI_FORMAT8P",null,null,"medecin",null,null,"Santé enfant","Vision","","","","LANGAGE",""]
[null,null,null,"Cadet image","CADETIMAG","A04X2_CADETIMAG",null,132,"donnée","dico",null,"E3APMI_FORMAT8P",null,null,"medecin",null,null,"Santé enfant","Vision","","","","LANGAGE",""]
[null,null,null,"Cadet lettres","CADETLETTR","A04X2_CADETLETTR",null,133,"donnée","dico",null,"E3APMI_FORMAT8P",null,null,"medecin",null,null,"Santé enfant","Vision","","","","LANGAGE",""]
[null,null,null,"E de Snellen","ESNELLEN","A04X2_ESNELLEN",null,134,"donnée","dico",null,"E3APMI_FORMAT8P",null,null,"medecin",null,null,"Santé enfant","Vision","","","","LANGAGE",""]
[null,null,null,"Autre","TESTVUEAUT","A04X2_TESTVUEAUT",null,137,"donnée","dico",null,"E3APMI_FORMAT8P",null,null,"medecin",null,null,"Santé enfant","Vision","","","","LANGAGE","",0]
[null,null,null,"LANGAGE",null,null,null,null,null,null,null,null,null,null,null,null,null,null,null,null,null,null,null,null,1]
[null,null,null,"Parle ou comprend une autre langue que le français (ou plusieurs)","LANGUETRANG","A04X2_LANGUETRANG",null,150,"donnée","dico",null,"E3APMI_FORMAT11P",null,null,"medecin",null,null,"Santé enfant","","","","","LANGAGE",""]
[null,null,null,"Préciser la lou les langues étrangères parlées ou comprises","LANGUETRANGP","* A04X2_LANGUETRANGP",null,151,"non-disponible","text",null,"",null,null,"medecin",null,null,"Santé enfant","","","","","LANGAGE",""]
[null,null,null,"Fait des phrases bien construites (verbes conjugués, prépositions, articles)","PHRASES","A04X2_PHRASES",null,152,"donnée","dico",null,"E3APMI_FORMAT23P",null,null,"medecin",null,null,"Santé enfant","Développement psychomoteur","","","","LANGAGE",""]
[null,null,null,"Est compréhensible facilement par une personne extérieure","COMPREHENS","A04X2_COMPREHENS",null,153,"donnée","dico",null,"E3APMI_FORMAT23P",null,null,"medecin",null,null,"Santé enfant","Développement psychomoteur","","","","LANGAGE",""]
[null,null,null,"Est capable de raconter une situation, décrire une image","RACONTE","A04X2_RACONTE",null,154,"donnée","dico",null,"E3APMI_FORMAT23P",null,null,"medecin",null,null,"Santé enfant","Développement psychomoteur","","","","LANGAGE",""]
[null,null,null,"ERTL4","ERTL4","A04X2_ERTL4",null,155,"donnée","dico",null,"E3APMI_FORMAT8P",null,null,"medecin",null,null,"Santé enfant","Développement psychomoteur","","","","LANGAGE",""]
[null,null,null,"Evalmater","EVALMATER","A04X2_EVALMATER",null,156,"donnée","dico",null,"E3APMI_FORMAT8P",null,null,"medecin",null,null,"Santé enfant","Développement psychomoteur","","","","LANGAGE",""]
[null,null,null,"Autre (chapitre langage)","AUTRTESTLANG","A04X2_AUTRTESTLANG",null,157,"donnée","dico",null,"E3APMI_FORMAT8P",null,null,"medecin",null,null,"Santé enfant","Développement psychomoteur","","","","LANGAGE",""]
[null,null,null,"Participation impossible au test","PARTICIPLANG","A04X2_PARTICIPLANG",null,158,"donnée","dico",null,"E3APMI_FORMAT8P",null,null,"medecin",null,null,"Santé enfant","Développement psychomoteur","","","","LANGAGE",""]
[null,null,null,"Test à revoir","TESTLANGREV","A04X2_TESTLANGREV",null,159,"donnée","dico",null,"E3APMI_FORMAT8P",null,null,"medecin",null,null,"Santé enfant","Développement psychomoteur","","","","LANGAGE",""]
[null,null,null,"Commentaire intrus inscrit dans la partie Langage","COMMLANG","* A04X2_COMMLANG",null,160,"non-disponible","text",null,"",null,null,"medecin",null,null,"Santé enfant","Développement psychomoteur","","","","LANGAGE","",0]
[null,null,null,"EXAMEN DENTAIRE",null,null,null,null,null,null,null,null,null,null,null,null,null,null,null,null,null,null,null,null,1]
[null,null,null,"Nombre de dents cariées non soignées","NBCARIESNS","A04X2_NBCARIESNS",null,140,"donnée","num",null,"",null,null,"medecin",null,null,"Santé enfant","Dentaire","","","","EXAMEN DENTAIRE",""]
[null,null,null,"Nombre de dents cariées soignées","NBCARIESOIN","A04X2_NBCARIESOIN",null,141,"donnée","num",null,"",null,null,"medecin",null,null,"Santé enfant","Dentaire","","","","EXAMEN DENTAIRE",""]
[null,null,null,"Nombre de dents traumatisées","TRAUMADENT","A04X2_TRAUMADENT",null,142,"donnée","num",null,"",null,null,"medecin",null,null,"Santé enfant","Dentaire","","","","EXAMEN DENTAIRE",""]
[null,null,null,"\"Nombre de dents cariées non soignées\" non vu","CARIENSNV","A04X2_CARIENSNV",null,143,"donnée","dico",null,"E3APMI_FORMAT8P",null,null,"medecin",null,null,"Santé enfant","Dentaire","","","","EXAMEN DENTAIRE",""]
[null,null,null,"\"Nombre de dents cariées  soignées\" non vu","CARIESOINNV","A04X2_CARIESOINNV",null,144,"donnée","dico",null,"E3APMI_FORMAT8P",null,null,"medecin",null,null,"Santé enfant","Dentaire","","","","EXAMEN DENTAIRE",""]
[null,null,null,"\"Nombre de dents traumatisées\" non vu","TRAUDENTNV","A04X2_TRAUDENTNV",null,145,"donnée","dico",null,"E3APMI_FORMAT8P",null,null,"medecin",null,null,"Santé enfant","Dentaire","","","","EXAMEN DENTAIRE",""]
[null,null,null,"Nombre total de dents","NBDENT","A04X2_NBDENT",null,146,"donnée","num",null,"",null,null,"medecin",null,null,"Santé enfant","Dentaire","","","","EXAMEN DENTAIRE",""]
[null,null,null,"Anomalie de l'articulé: béance antérieure","BEANCEANT","A04X2_BEANCEANT",null,147,"donnée","dico",null,"E3APMI_FORMAT21P",null,null,"medecin",null,null,"Santé enfant","Dentaire","","","","EXAMEN DENTAIRE",""]
[null,null,null,"Anomalie de l'articulé: occlusion inversée","OCCLINVERS","A04X2_OCCLINVERS",null,148,"donnée","dico",null,"E3APMI_FORMAT22P",null,null,"medecin",null,null,"Santé enfant","Dentaire","","","","EXAMEN DENTAIRE",""]
[null,null,null,"Commentaire intrus inscrit dans la partie Dentaire","COMMDENT","* A04X2_COMMDENT",null,149,"non-disponible","text",null,"",null,null,"medecin",null,null,"Santé enfant","Dentaire","","","","EXAMEN DENTAIRE","",0]
[null,null,null,"EXAMEN PSYCHOMOTEUR",null,null,null,null,null,null,null,null,null,null,null,null,null,null,null,null,null,null,null,null,1]
[null,null,null,"Connaît au moins trois couleurs","COULEURS","A04X2_COULEURS",null,161,"donnée","dico",null,"E3APMI_FORMAT24P",null,null,"medecin",null,null,"Santé enfant","Développement psychomoteur","","","","EXAMEN PSYCHOMOTEUR",""]
[null,null,null,"Dessine un bonhomme en trois parties","BONHOMME","A04X2_BONHOMME",null,162,"donnée","dico",null,"E3APMI_FORMAT24P",null,null,"medecin",null,null,"Santé enfant","Développement psychomoteur","","","","EXAMEN PSYCHOMOTEUR",""]
[null,null,null,"Praxie 5ème main D- pouce main G","PRAXIE","A04X2_PRAXIE",null,163,"donnée","dico",null,"E3APMI_FORMAT24P",null,null,"medecin",null,null,"Santé enfant","Développement psychomoteur","","","","EXAMEN PSYCHOMOTEUR",""]
[null,null,null,"Met seul un vêtement","HABIT","A04X2_HABIT",null,164,"donnée","dico",null,"E3APMI_FORMAT24P",null,null,"medecin",null,null,"Santé enfant","Développement psychomoteur","","","","EXAMEN PSYCHOMOTEUR",""]
[null,null,null,"Descend un escalier en alternant les pieds","ESCALIER","A04X2_ESCALIER",null,165,"donnée","dico",null,"E3APMI_FORMAT25P",null,null,"medecin",null,null,"Santé enfant","Développement psychomoteur","","","","EXAMEN PSYCHOMOTEUR",""]
[null,null,null,"Saute en avant","SAUTE","A04X2_SAUTE",null,166,"donnée","dico",null,"E3APMI_FORMAT24P",null,null,"medecin",null,null,"Santé enfant","Développement psychomoteur","","","","EXAMEN PSYCHOMOTEUR",""]
[null,null,null,"Tient sur un pied 3 secondes","UNPIED","A04X2_UNPIED",null,167,"donnée","dico",null,"E3APMI_FORMAT24P",null,null,"medecin",null,null,"Santé enfant","Développement psychomoteur","","","","EXAMEN PSYCHOMOTEUR",""]
[null,null,null,"S'oriente dans l'espace","ESPACE","A04X2_ESPACE",null,168,"donnée","dico",null,"E3APMI_FORMAT24P",null,null,"medecin",null,null,"Santé enfant","Développement psychomoteur","","","","EXAMEN PSYCHOMOTEUR",""]
[null,null,null,"Commentaire intrus inscrit dans la partie psychomoteur","COMMPSYM","* A04X2_COMMPSYM",null,169,"non-disponible","text",null,"",null,null,"medecin",null,null,"Santé enfant","Développement psychomoteur","","","","EXAMEN PSYCHOMOTEUR","",0]
[null,null,null,"CONSEIL(S) D’ORIENTATION(S) DONNÉ(S) AUX PARENTS",null,null,null,null,null,null,null,null,null,null,null,null,null,null,null,null,null,null,null,null,1]
[null,null,null,"Médecin traitant (chapitre Conseils d'orientation donnés aux parents)","MEDTRAIT","A04X2_MEDTRAIT",null,170,"donnée","dico",null,"E3APMI_FORMAT11P",null,null,"medecin",null,null,"Santé enfant","Recours aux soins","","","","CONSEIL(S) D’ORIENTATION(S) DONNÉ(S) AUX PARENTS",""]
[null,null,null,"ORL","ORL","A04X2_ORL",null,171,"donnée","dico",null,"E3APMI_FORMAT26P",null,null,"medecin",null,null,"Santé enfant","Recours aux soins","","","","CONSEIL(S) D’ORIENTATION(S) DONNÉ(S) AUX PARENTS",""]
[null,null,null,"Ophtalmologiste","OPHTALMO","A04X2_OPHTALMO",null,172,"donnée","dico",null,"E3APMI_FORMAT26P",null,null,"medecin",null,null,"Santé enfant","Recours aux soins","","","","CONSEIL(S) D’ORIENTATION(S) DONNÉ(S) AUX PARENTS",""]
[null,null,null,"Dentiste ou stomatologue","DENTISTE","A04X2_DENTISTE",null,173,"donnée","dico",null,"E3APMI_FORMAT26P",null,null,"medecin",null,null,"Santé enfant","Recours aux soins","","","","CONSEIL(S) D’ORIENTATION(S) DONNÉ(S) AUX PARENTS",""]
[null,null,null,"Orthophoniste","ORTHOPHON","A04X2_ORTHOPHON",null,174,"donnée","dico",null,"E3APMI_FORMAT26P",null,null,"medecin",null,null,"Santé enfant","Recours aux soins","","","","CONSEIL(S) D’ORIENTATION(S) DONNÉ(S) AUX PARENTS",""]
[null,null,null,"Pédopsychiatre","PEDOPSY","A04X2_PEDOPSY",null,175,"donnée","dico",null,"E3APMI_FORMAT26P",null,null,"medecin",null,null,"Santé enfant","Recours aux soins","","","","CONSEIL(S) D’ORIENTATION(S) DONNÉ(S) AUX PARENTS",""]
[null,null,null,"Psychologue","PSYCHOL","A04X2_PSYCHOL",null,176,"donnée","dico",null,"E3APMI_FORMAT26P",null,null,"medecin",null,null,"Santé enfant","Recours aux soins","","","","CONSEIL(S) D’ORIENTATION(S) DONNÉ(S) AUX PARENTS",""]
[null,null,null,"Psychomotricienne","PSYCHOMOT","A04X2_PSYCHOMOT",null,177,"donnée","dico",null,"E3APMI_FORMAT26P",null,null,"medecin",null,null,"Santé enfant","Recours aux soins","","","","CONSEIL(S) D’ORIENTATION(S) DONNÉ(S) AUX PARENTS",""]
[null,null,null,"Autre professionnel de santé 1","AUTRPROF1","A04X2_AUTRPROF1",null,178,"donnée","dico",null,"E3APMI_FORMAT26P",null,null,"medecin",null,null,"Santé enfant","Recours aux soins","","","","CONSEIL(S) D’ORIENTATION(S) DONNÉ(S) AUX PARENTS",""]
[null,null,null,"Autre professionnel de santé 1: préciser","AUTRPROF1P","A04X2_AUTRPROF1P",null,179,"non-disponible","text",null,"",null,null,"medecin",null,null,"Santé enfant","Recours aux soins","","","","CONSEIL(S) D’ORIENTATION(S) DONNÉ(S) AUX PARENTS",""]
[null,null,null,"Autre professionnel de santé 2","AUTRPROF2","A04X2_AUTRPROF2",null,180,"donnée","dico",null,"E3APMI_FORMAT26P",null,null,"medecin",null,null,"Santé enfant","Recours aux soins","","","","CONSEIL(S) D’ORIENTATION(S) DONNÉ(S) AUX PARENTS",""]
[null,null,null,"Autre professionnel de santé 2: préciser","AUTRPROF2P","A04X2_AUTRPROF2P",null,181,"non-disponible","text",null,"",null,null,"medecin",null,null,"Santé enfant","Recours aux soins","","","","CONSEIL(S) D’ORIENTATION(S) DONNÉ(S) AUX PARENTS",""]
[null,null,null,"Avez-vous orienté l'enfant vers le CAMSP?","CAMSP","A04X2_CAMSP",null,182,"donnée","dico",null,"E3APMI_FORMAT26P",null,null,"medecin",null,null,"Santé enfant","Recours aux soins","","","","CONSEIL(S) D’ORIENTATION(S) DONNÉ(S) AUX PARENTS",""]
[null,null,null,"Avez-vous orienté l'enfant vers le CMP ou le CMPP?","CMPCMPP","A04X2_CMPCMPP",null,183,"donnée","dico",null,"E3APMI_FORMAT26P",null,null,"medecin",null,null,"Santé enfant","Recours aux soins","","","","CONSEIL(S) D’ORIENTATION(S) DONNÉ(S) AUX PARENTS",""]
[null,null,null,"Commentaire intrus inscrit dans la partie Orientation","COMMORIENT","* A04X2_COMMORIENT",null,184,"non-disponible","text",null,"",null,null,"medecin",null,null,"Santé enfant","Recours aux soins","","","","CONSEIL(S) D’ORIENTATION(S) DONNÉ(S) AUX PARENTS","",0]
[null,null,null,"SUIVI",null,null,null,null,null,null,null,null,null,null,null,null,null,null,null,null,null,null,null,null,1]
[null,null,null,"Prévoyez -vous une liaison avec le médecin traitant?","LIAISONMED","A04X2_LIAISONMED",null,185,"donnée","dico",null,"E3APMI_FORMAT27P",null,null,"medecin",null,null,"Santé enfant","Recours aux soins","","","","SUIVI",""]
[null,null,null,"Pensez-vous être amené à revoir cet enfant l'année prochaine?","ENFAREVOIR","A04X2_ENFAREVOIR",null,186,"donnée","dico",null,"E3APMI_FORMAT27P",null,null,"medecin",null,null,"Santé enfant","Recours aux soins","","","","SUIVI",""]
[null,null,null,"Commentaire intrus inscrit dans la partie Suivi","COMMSUIVI","* A04X2_COMMSUIVI",null,187,"non-disponible","text",null,"",null,null,"medecin",null,null,"Santé enfant","Recours aux soins","","","","SUIVI",""]
[null,null,null,"Commentaires","COMMENTP","* A04X2_COMMENTP",null,188,"non-disponible","text",null,"",null,null,"medecin",null,null,"Santé enfant","Recours aux soins","","","","SUIVI","",0]

{"sheet":"E4A_ECOLE","index":5,"n_rows":169,"n_cols":70,"rows_kept":169,"cut":false,"hidden":false,"merged":[]}
["SELECTION\n(par variable ou par section)","SELECTION\n(par thème 1)","SELECTION\n(par QUEST STANDARD)","LABEL","QUESTION QUESTIONNAIRE","QUESTION BASE","QUESTION BASE",null,"TYPE","FORMAT","CHAPEAU","DICO","DESCRIPTION","CONTRÔLE","THEME(01)","THEME(02)","THEME(03)","THEME1","THEME2","THEME3","THEME4","THEME5","THEME6","QUEST STANDARD","THEME_TITRE","","","","","","","","","","","","","","","","","","","","","","","","","","E4A_ECOLE","E4A_ECOLE","","","","","","","","","","","","","","","","","",""]
[null,null,null,{"$f":"CONCATENATE(\"Sélection totale : \",COUNTIFS(A:A,\"X\",I:I,\"*\")+COUNTIFS(B:B,\"X\",I:I,\"*\")+COUNTIFS(C:C,\"X\",I:I,\"*\"),\" variable(s)\")","v":"Sélection totale : 0 variable(s)"},null,null,null,null,null,null,null,null,null,null,null,null,null,null,null,null,null,null,null,null,null,null,{"$f":"COUNTIFS(A:A,\"X\",I:I,\"non-disponible\")+COUNTIFS(B:B,\"X\",I:I,\"non-disponible\")+COUNTIFS(C:C,\"X\",I:I,\"non-disponible\")","v":0},{"$f":"SUM(COUNTIFS($A:$A,\"X\",$E:$E,{\"ACRELI\";\"ACCHRET\";\"ACMUSUL\";\"LRELI\";\"QLCHRET\";\"QLMUSUL\";\"POLIT\"})+COUNTIFS($B:$B,\"X\",$E:$E,{\"ACRELI\";\"ACCHRET\";\"ACMUSUL\";\"LRELI\";\"QLCHRET\";\"QLMUSUL\";\"POLIT\"})+COUNTIFS($C:$C,\"X\",$E:$E,{\"ACRELI\";\"ACCHRET\";\"ACMUSUL\";\"LRELI\";\"QLCHRET\";\"QLMUSUL\";\"POLIT\"}))","v":0}]
[null,null,null,"GESTION",null,null,null,null,null,null,null,null,null,null,null,null,null,null,null,null,null,null,null,null,1]
[null,null,null,"Numéro de vague","VAGUE","A04X_VAGUE",null,null,"donnée","dico","","E4A_EC_VAGUE","Numéro de vague","","4 ans","auto-questionnaire école","gestion","","","","","","gestion",""]
[null,null,null,"Éducation prioritaire","EDUCPRIO","A04X_EDUCPRIO",null,null,"donnée","dico","","E4A_EC_ON","Education prioritaire","","4 ans","auto-questionnaire école","gestion","","","","","","gestion",""]
[null,null,null,"Secteur public/privé","PUBLPRIV","A04X_PUBLPRIV",null,null,"donnée","dico","","E4A_EC_PUPR","Secteur public/privé","","4 ans","auto-questionnaire école","gestion","","","","","","gestion",""]
[null,null,null,"Commune école (code insee)","GEOCODEC","A04X_GEOCODEC",null,null,"non-disponible","text","","","Commune école (code insee)","","4 ans","auto-questionnaire école","gestion","","","","","","gestion",""]
[null,null,null,"Nombre d'enfants elfe par école","NBENFECOLE","A04X_NBENFECOLE",null,null,"donnée","num","","","Nombre d'enfants elfe par école","","4 ans","auto-questionnaire école","gestion","","","","","","gestion",""]
[null,null,null,"Nombre de réponses pour la partie enfant","NBREPENF","A04X_NBREPENF",null,null,"donnée","num","","","Nombre de variables répondues questionnaire enfant","","4 ans","auto-questionnaire école","gestion","","","","","","gestion",""]
[null,null,null,"Nombre de réponses pour la partie enseignant","NBREPENS","A04X_NBREPENS",null,null,"donnée","num","","","Nombre de variables répondues questionnaire enseignant","","4 ans","auto-questionnaire école","gestion","","","","","","gestion",""]
[null,null,null,"Numéro de l'enfant elfe (enfant elfe=1)","ENFELFE","A04X_ENFELFE",null,null,"donnée","num","","","Numéro de l'enfant elfe (enfant elfe=1)","","4 ans","auto-questionnaire école","gestion","","","","","","gestion",""]
[null,null,null,"Nombre d'enfants par questionnaire","NBENFQUEST","A04X_NBENFQUEST",null,null,"donnée","num","","","Nombre d'enfants par questionnaire","","4 ans","auto-questionnaire école","gestion","","","","","","gestion","",0]
[null,null,null,"ETAT CIVIL",null,null,null,null,null,null,null,null,null,null,null,null,null,null,null,null,null,null,null,null,1]
[null,null,null,"Mois de naissance de l'enfant elfe","DATNAISSM","A04X_DATNAISSM",null,null,"non-disponible","num","","","Mois de naissance de l'enfant elfe","","4 ans","auto-questionnaire école","état civil","","","","","","etat civil",""]
[null,null,null,"Age de l'enfant en mois","AGE4A","A04X_AGE4A",null,null,"donnée","num","","","Age de l'enfant en mois","","4 ans","auto-questionnaire école","état civil","","","","","","etat civil",""]
[null,null,null,"Sexe de l'enfant elfe","SEXE","A04X_SEXE",null,null,"donnée","dico","","E4A_EC_SEXE","Sexe de l'enfant elfe","","4 ans","auto-questionnaire école","état civil","","","","","","etat civil","",0]
[null,null,null,"DÉNOMBREMENT",null,null,null,null,null,null,null,null,null,null,null,null,null,null,null,null,null,null,null,null,1]
[null,null,null,"Tracer 4 balles","BALLE4","A04X_BALLE4",null,null,"donnée","dico","","E4A_EC_FORMAT2F","Tracer 4 balles","","4 ans","auto-questionnaire école","questionnaire enfant","mode de garde, scolarisation","développement psychomoteur","","","","dénombrement",""]
[null,null,null,"Tracer 6 balles","BALLE6","A04X_BALLE6",null,null,"donnée","dico","","E4A_EC_FORMAT2F","Tracer 6 balles","","4 ans","auto-questionnaire école","questionnaire enfant","mode de garde, scolarisation","développement psychomoteur","","","","dénombrement",""]
[null,null,null,"Tracer 5 balles","BALLE5","A04X_BALLE5",null,null,"donnée","dico","","E4A_EC_FORMAT2F","Tracer 5 balles","","4 ans","auto-questionnaire école","questionnaire enfant","mode de garde, scolarisation","développement psychomoteur","","","","dénombrement",""]
[null,null,null,"Résoudre (1+1+1)","JETON3","A04X_JETON3",null,null,"donnée","dico","","E4A_EC_FORMAT2F","Résoudre (1+1+1)","","4 ans","auto-questionnaire école","questionnaire enfant","mode de garde, scolarisation","développement psychomoteur","","","","dénombrement",""]
[null,null,null,"Résoudre (2+2)","JETON4A","A04X_JETON4A",null,null,"donnée","dico","","E4A_EC_FORMAT2F","Résoudre (2+2)","","4 ans","auto-questionnaire école","questionnaire enfant","mode de garde, scolarisation","développement psychomoteur",null,"","","dénombrement",""]
[null,null,null,"Résoudre (1+1+1+1)","JETON4B","A04X_JETON4B",null,null,"donnée","dico","","E4A_EC_FORMAT2F","Résoudre (1+1+1+1)","","4 ans","auto-questionnaire école","questionnaire enfant","mode de garde, scolarisation","développement psychomoteur","","","","dénombrement",""]
[null,null,null,"Résoudre (3+2)","JETON5","A04X_JETON5",null,null,"donnée","dico","","E4A_EC_FORMAT2F","Résoudre (3+2)","","4 ans","auto-questionnaire école","questionnaire enfant","mode de garde, scolarisation","développement psychomoteur","","","","dénombrement",""]
[null,null,null,"Résoudre (3-2)","JETON1A","A04X_JETON1A",null,null,"donnée","dico","","E4A_EC_FORMAT2F","Résoudre (3-2)","","4 ans","auto-questionnaire école","questionnaire enfant","mode de garde, scolarisation","développement psychomoteur","","","","dénombrement",""]
[null,null,null,"Résoudre (1+1+1-2)","JETON1B","A04X_JETON1B",null,null,"donnée","dico","","E4A_EC_FORMAT2F","Résoudre (1+1+1-2)","","4 ans","auto-questionnaire école","questionnaire enfant","mode de garde, scolarisation","développement psychomoteur","","","","dénombrement",""]
[null,null,null,"Comparer 2 collections (7 et 9 unités)","LAPIN","A04X_LAPIN",null,null,"donnée","dico","","E4A_EC_FORMAT2F","Comparer 2 collections (7 et 9 unités)","","4 ans","auto-questionnaire école","questionnaire enfant","mode de garde, scolarisation","développement psychomoteur","","","","dénombrement",""]
[null,null,null,"Comparer 2 collections (ronds de tailles différentes)","ROND1A","A04X_ROND1A",null,null,"donnée","dico","","E4A_EC_FORMAT2F","Comparer 2 collections (ronds de tailles différentes)","","4 ans","auto-questionnaire école","questionnaire enfant","mode de garde, scolarisation","développement psychomoteur","","","","dénombrement",""]
[null,null,null,"Comparer 2 collections (ronds de mêmes tailles répartis différemment)","ROND1B","A04X_ROND1B",null,null,"donnée","dico","","E4A_EC_FORMAT2F","Comparer 2 collections (ronds de mêmes tailles répartis différemment)","","4 ans","auto-questionnaire école","questionnaire enfant","mode de garde, scolarisation","développement psychomoteur","","","","dénombrement",""]
[null,null,null,"Comparer 2 collections (ronds de tailles différentes)","ROND1C","A04X_ROND1C",null,null,"donnée","dico","","E4A_EC_FORMAT2F","Comparer 2 collections (ronds de tailles différentes)","","4 ans","auto-questionnaire école","questionnaire enfant","mode de garde, scolarisation","développement psychomoteur","","","","dénombrement",""]
[null,null,null,"Reconnaître une collection égale à 7","SAPIN7","A04X_SAPIN7",null,null,"donnée","dico","","E4A_EC_FORMAT2F","Reconnaitre une collection égale à 7","","4 ans","auto-questionnaire école","questionnaire enfant","mode de garde, scolarisation","développement psychomoteur","","","","dénombrement",""]
[null,null,null,"Reconnaître une collection égale à 3","SAPIN3","A04X_SAPIN3",null,null,"donnée","dico","","E4A_EC_FORMAT2F","Reconnaitre une collection égale à 3","","4 ans","auto-questionnaire école","questionnaire enfant","mode de garde, scolarisation","développement psychomoteur","","","","dénombrement",""]
[null,null,null,"Reconnaître une collection égale à 5","SAPIN5","A04X_SAPIN5",null,null,"donnée","dico","","E4A_EC_FORMAT2F","Reconnaitre une collection égale à 5","","4 ans","auto-questionnaire école","questionnaire enfant","mode de garde, scolarisation","développement psychomoteur","","","","dénombrement",""]
[null,null,null,"Reconnaître une collection égale à 6 (collection restante)","SAPIN6","A04X_SAPIN6",null,null,"donnée","dico","","E4A_EC_FORMAT2F","Reconnaitre une collection égale à 6 (collection restante)","","4 ans","auto-questionnaire école","questionnaire enfant","mode de garde, scolarisation","développement psychomoteur","","","","dénombrement",""]
[null,null,null,"Reconnaître le chiffre 6 (parmi 12 nombres)","CHIFFRE6","A04X_CHIFFRE6",null,null,"donnée","dico","","E4A_EC_FORMAT2F","Reconnaitre le chiffre 6 (parmi 12 nombres)","","4 ans","auto-questionnaire école","questionnaire enfant","mode de garde, scolarisation","développement psychomoteur","","","","dénombrement",""]
[null,null,null,"Reconnaître le chiffre 4 (parmi 12 nombres)","CHIFFRE4","A04X_CHIFFRE4",null,null,"donnée","dico","","E4A_EC_FORMAT2F","Reconnaitre le chiffre 4 (parmi 12 nombres)","","4 ans","auto-questionnaire école","questionnaire enfant","mode de garde, scolarisation","développement psychomoteur","","","","dénombrement",""]
[null,null,null,"Reconnaître le chiffre 7 (parmi 12 nombres)","CHIFFRE7","A04X_CHIFFRE7",null,null,"donnée","dico","","E4A_EC_FORMAT2F","Reconnaitre le chiffre 7 (parmi 12 nombres)","","4 ans","auto-questionnaire école","questionnaire enfant","mode de garde, scolarisation","développement psychomoteur","","","","dénombrement",""]
[null,null,null,"Reconnaître le chiffre 5 (parmi 12 nombres)","CHIFFRE5","A04X_CHIFFRE5",null,null,"donnée","dico","","E4A_EC_FORMAT2F","Reconnaitre le chiffre 5 (parmi 12 nombres)","","4 ans","auto-questionnaire école","questionnaire enfant","mode de garde, scolarisation","développement psychomoteur","","","","dénombrement",""]
[null,null,null,"Reconnaître le nombre 10 (parmi 12 nombres)","CHIFFRE10","A04X_CHIFFRE10",null,null,"donnée","dico","","E4A_EC_FORMAT2F","Reconnaitre le nombre 10 (parmi 12 nombres)","","4 ans","auto-questionnaire école","questionnaire enfant","mode de garde, scolarisation","développement psychomoteur","","","","dénombrement",""]
[null,null,null,"Dénombrer et écrire le chiffre 2","CANARD2","A04X_CANARD2",null,null,"donnée","dico","","E4A_EC_FORMAT3F","Dénombrer et écrire le chiffre 2","","4 ans","auto-questionnaire école","questionnaire enfant","mode de garde, scolarisation","développement psychomoteur","","","","dénombrement",""]
[null,null,null,"Dénombrer et écrire le chiffre 4","CANARD4","A04X_CANARD4",null,null,"donnée","dico","","E4A_EC_FORMAT3F","Dénombrer et écrire le chiffre 4","","4 ans","auto-questionnaire école","questionnaire enfant","mode de garde, scolarisation","développement psychomoteur","","","","dénombrement",""]
[null,null,null,"Dénombrer et écrire le chiffre 5","CANARD5","A04X_CANARD5",null,null,"donnée","dico","","E4A_EC_FORMAT3F","Dénombrer et écrire le chiffre 5","","4 ans","auto-questionnaire école","questionnaire enfant","mode de garde, scolarisation","développement psychomoteur","","","","dénombrement",""]
[null,null,null,"Dénombrer et écrire le chiffre 3","CANARD3","A04X_CANARD3",null,null,"donnée","dico","","E4A_EC_FORMAT3F","Dénombrer et écrire le chiffre 3","","4 ans","auto-questionnaire école","questionnaire enfant","mode de garde, scolarisation","développement psychomoteur","","","","dénombrement",""]
[null,null,null,"Dénombrer et écrire le chiffre 1","CANARD1","A04X_CANARD1",null,null,"donnée","dico","","E4A_EC_FORMAT3F","Dénombrer et écrire le chiffre 1","","4 ans","auto-questionnaire école","questionnaire enfant","mode de garde, scolarisation","développement psychomoteur","","","","dénombrement","",0]
[null,null,null,"ATTENTION VISUELLE",null,null,null,null,null,null,null,null,null,null,null,null,null,null,null,null,null,null,null,null,1]
[null,null,null,"Reconnaître et entourer 15 nounours (parmi 75 objets)","NOUNOURS15","A04X_NOUNOURS15",null,null,"donnée","num","","","Reconnaitre et entourer 15 nounours (parmi 75 objets)","","4 ans","auto-questionnaire école","questionnaire enfant","mode de garde, scolarisation","développement psychomoteur","","","","attention visuelle",""]
[null,null,null,"Au moins un distracteur entouré","NOUNOURS","A04X_NOUNOURS",null,null,"donnée","dico","","E4A_EC_FORMAT4F","Au moins un distracteur entouré","","4 ans","auto-questionnaire école","questionnaire enfant","mode de garde, scolarisation","développement psychomoteur","","","","attention visuelle","",0]
[null,null,null,"ALPHABET",null,null,null,null,null,null,null,null,null,null,null,null,null,null,null,null,null,null,null,null,1]
[null,null,null,"Reconnaître la lettre g","LETTRG","A04X_LETTRG",null,null,"donnée","dico","","E4A_EC_FORMAT2F","Reconnaitre la lettre g","","4 ans","auto-questionnaire école","questionnaire enfant","mode de garde, scolarisation","développement psychomoteur","","","","alphabet",""]
[null,null,null,"Reconnaître la lettre p","LETTRP","A04X_LETTRP",null,null,"donnée","dico","","E4A_EC_FORMAT2F","Reconnaitre la lettre p","","4 ans","auto-questionnaire école","questionnaire enfant","mode de garde, scolarisation","développement psychomoteur","","","","alphabet",""]
[null,null,null,"Reconnaître la lettre r","LETTRR","A04X_LETTRR",null,null,"donnée","dico","","E4A_EC_FORMAT2F","Reconnaitre la lettre r","","4 ans","auto-questionnaire école","questionnaire enfant","mode de garde, scolarisation","développement psychomoteur","","","","alphabet",""]
[null,null,null,"Reconnaître la lettre v","LETTRV","A04X_LETTRV",null,null,"donnée","dico","","E4A_EC_FORMAT2F","Reconnaitre la lettre v","","4 ans","auto-questionnaire école","questionnaire enfant","mode de garde, scolarisation","développement psychomoteur","","","","alphabet",""]
[null,null,null,"Reconnaître la lettre d","LETTRD","A04X_LETTRD",null,null,"donnée","dico","","E4A_EC_FORMAT2F","Reconnaitre la lettre d","","4 ans","auto-questionnaire école","questionnaire enfant","mode de garde, scolarisation","développement psychomoteur","","","","alphabet",""]
[null,null,null,"Reconnaître la lettre b","LETTRB","A04X_LETTRB",null,null,"donnée","dico","","E4A_EC_FORMAT2F","Reconnaitre la lettre b","","4 ans","auto-questionnaire école","questionnaire enfant","mode de garde, scolarisation","développement psychomoteur","","","","alphabet",""]
[null,null,null,"Reconnaître la lettre c","LETTRC","A04X_LETTRC",null,null,"donnée","dico","","E4A_EC_FORMAT2F","Reconnaitre la lettre c","","4 ans","auto-questionnaire école","questionnaire enfant","mode de garde, scolarisation","développement psychomoteur","","","","alphabet",""]
[null,null,null,"Reconnaître la lettre j","LETTRJ","A04X_LETTRJ",null,null,"donnée","dico","","E4A_EC_FORMAT2F","Reconnaitre la lettre j","","4 ans","auto-questionnaire école","questionnaire enfant","mode de garde, scolarisation","développement psychomoteur","","","","alphabet",""]
[null,null,null,"Reconnaître la lettre q","LETTRQ","A04X_LETTRQ",null,null,"donnée","dico","","E4A_EC_FORMAT2F","Reconnaitre la lettre q","","4 ans","auto-questionnaire école","questionnaire enfant","mode de garde, scolarisation","développement psychomoteur","","","","alphabet",""]
[null,null,null,"Reconnaître la lettre t","LETTRT","A04X_LETTRT",null,null,"donnée","dico","","E4A_EC_FORMAT2F","Reconnaitre la lettre t","","4 ans","auto-questionnaire école","questionnaire enfant","mode de garde, scolarisation","développement psychomoteur","","","","alphabet","",0]
[null,null,null,"PHONOLOGIE",null,null,null,null,null,null,null,null,null,null,null,null,null,null,null,null,null,null,null,null,1]
[null,null,null,"Détecter un son différent (parmi 3 mots)","TOUPIE","A04X_TOUPIE",null,null,"donnée","dico","","E4A_EC_FORMAT2F","Détecter un son différent (parmi 3 mots)","","4 ans","auto-questionnaire école","questionnaire enfant","mode de garde, scolarisation","développement psychomoteur","","","","phonologie",""]
[null,null,null,"Détecter un son différent (parmi 3 mots)","PANTIN","A04X_PANTIN",null,null,"donnée","dico","","E4A_EC_FORMAT2F","Détecter un son différent (parmi 3 mots)","","4 ans","auto-questionnaire école","questionnaire enfant","mode de garde, scolarisation","développement psychomoteur","","","","phonologie",""]
[null,null,null,"Détecter un son différent (parmi 3 mots)","PELLE","A04X_PELLE",null,null,"donnée","dico","","E4A_EC_FORMAT2F","Détecter un son différent (parmi 3 mots)","","4 ans","auto-questionnaire école","questionnaire enfant","mode de garde, scolarisation","développement psychomoteur","","","","phonologie",""]
[null,null,null,"Détecter un son différent (parmi 3 mots)","FUSEE","A04X_FUSEE",null,null,"donnée","dico","","E4A_EC_FORMAT2F","Détecter un son différent (parmi 3 mots)","","4 ans","auto-questionnaire école","questionnaire enfant","mode de garde, scolarisation","développement psychomoteur","","","","phonologie",""]
[null,null,null,"Détecter un son différent (parmi 3 mots)","POUSSIN","A04X_POUSSIN",null,null,"donnée","dico","","E4A_EC_FORMAT2F","Détecter un son différent (parmi 3 mots)","","4 ans","auto-questionnaire école","questionnaire enfant","mode de garde, scolarisation","développement psychomoteur","","","","phonologie",""]
[null,null,null,"Détecter un son différent (parmi 3 mots)","MOTO","A04X_MOTO",null,null,"donnée","dico","","E4A_EC_FORMAT2F","Détecter un son différent (parmi 3 mots)","","4 ans","auto-questionnaire école","questionnaire enfant","mode de garde, scolarisation","développement psychomoteur","","","","phonologie",""]
[null,null,null,"Détecter un son différent (parmi 3 mots)","COEUR","A04X_COEUR",null,null,"donnée","dico","","E4A_EC_FORMAT2F","Détecter un son différent (parmi 3 mots)","","4 ans","auto-questionnaire école","questionnaire enfant","mode de garde, scolarisation","développement psychomoteur","","","","phonologie",""]
[null,null,null,"Détecter un son différent (parmi 3 mots)","PIPE","A04X_PIPE",null,null,"donnée","dico","","E4A_EC_FORMAT2F","Détecter un son différent (parmi 3 sons)","","4 ans","auto-questionnaire école","questionnaire enfant","mode de garde, scolarisation","développement psychomoteur","","","","phonologie",""]
[null,null,null,"Détecter un son différent (parmi 3 mots)","JUDO","A04X_JUDO",null,null,"donnée","dico","","E4A_EC_FORMAT2F","Détecter un son différent (parmi 3 mots)","","4 ans","auto-questionnaire école","questionnaire enfant","mode de garde, scolarisation","développement psychomoteur","","","","phonologie",""]
[null,null,null,"Supprimer la première syllabe du mot bijoux","JOUE","A04X_JOUE",null,null,"donnée","dico","","E4A_EC_FORMAT2F","Supprimer la première syllabe du mot bijoux","","4 ans","auto-questionnaire école","questionnaire enfant","mode de garde, scolarisation","développement psychomoteur","","","","phonologie",""]
[null,null,null,"Supprimer la première syllabe du mot balai","LAIT","A04X_LAIT",null,null,"donnée","dico","","E4A_EC_FORMAT2F","Supprimer la première syllabe du mot balai","","4 ans","auto-questionnaire école","questionnaire enfant","mode de garde, scolarisation","développement psychomoteur","","","","phonologie",""]
[null,null,null,"Supprimer la première syllabe du mot souris","RIZ","A04X_RIZ",null,null,"donnée","dico","","E4A_EC_FORMAT2F","Supprimer la première syllabe du mot souris","","4 ans","auto-questionnaire école","questionnaire enfant","mode de garde, scolarisation","développement psychomoteur","","","","phonologie",""]
[null,null,null,"Supprimer la première syllabe du mot citron","TRONC","A04X_TRONC",null,null,"donnée","dico","","E4A_EC_FORMAT2F","Supprimer la première syllabe du mot citron","","4 ans","auto-questionnaire école","questionnaire enfant","mode de garde, scolarisation","développement psychomoteur","","","","phonologie",""]
[null,null,null,"Supprimer la première syllabe du mot cadeau","DOS","A04X_DOS",null,null,"donnée","dico","","E4A_EC_FORMAT2F","Supprimer la première syllabe du mot cadeau","","4 ans","auto-questionnaire école","questionnaire enfant","mode de garde, scolarisation","développement psychomoteur","","","","phonologie",""]
[null,null,null,"Supprimer la première syllabe du mot toupie","PIE","A04X_PIE",null,null,"donnée","dico","","E4A_EC_FORMAT2F","Supprimer la première syllabe du mot toupie","","4 ans","auto-questionnaire école","questionnaire enfant","mode de garde, scolarisation","développement psychomoteur","","","","phonologie","",0]
[null,null,null,"VOCABULAIRE",null,null,null,null,null,null,null,null,null,null,null,null,null,null,null,null,null,null,null,null,1]
[null,null,null,"Détecter l'image correspondant à mouche (parmi 4 images)","MOUCHE","A04X_MOUCHE",null,null,"donnée","dico","","E4A_EC_FORMAT2F","Détecter l'image correspondante à mouche (parmi 4 images)","","4 ans","auto-questionnaire école","questionnaire enfant","mode de garde, scolarisation","développement psychomoteur","","","","vocabulaire",""]
[null,null,null,"Détecter l'image correspondant à plonger (parmi 4 images)","PLONGER","A04X_PLONGER",null,null,"donnée","dico","","E4A_EC_FORMAT2F","Détecter l'image correspondante à plonger (parmi 4 images)","","4 ans","auto-questionnaire école","questionnaire enfant","mode de garde, scolarisation","développement psychomoteur","","","","vocabulaire",""]
[null,null,null,"Détecter l'image correspondant à luge (parmi 4 images)","LUGE","A04X_LUGE",null,null,"donnée","dico","","E4A_EC_FORMAT2F","Détecter l'image correspondante à luge (parmi 4 images)","","4 ans","auto-questionnaire école","questionnaire enfant","mode de garde, scolarisation","développement psychomoteur","","","","vocabulaire",""]
[null,null,null,"Détecter l'image correspondant à gland (parmi 4 images)","GLAND","A04X_GLAND",null,null,"donnée","dico","","E4A_EC_FORMAT2F","Détecter l'image correspondante à gland (parmi 4 images)","","4 ans","auto-questionnaire école","questionnaire enfant","mode de garde, scolarisation","développement psychomoteur","","","","vocabulaire",""]
[null,null,null,"Détecter l'image correspondant à radeau (parmi 4 images)","RADEAU","A04X_RADEAU",null,null,"donnée","dico","","E4A_EC_FORMAT2F","Détecter l'image correspondante à radeau (parmi 4 images)","","4 ans","auto-questionnaire école","questionnaire enfant","mode de garde, scolarisation","développement psychomoteur","","","","vocabulaire",""]
[null,null,null,"Détecter l'image correspondant à livrer (parmi 4 images)","LIVRER","A04X_LIVRER",null,null,"donnée","dico","","E4A_EC_FORMAT2F","Détecter l'image correspondante à livrer (parmi 4 images)","","4 ans","auto-questionnaire école","questionnaire enfant","mode de garde, scolarisation","développement psychomoteur","","","","vocabulaire",""]
[null,null,null,"Détecter l'image correspondant à chimpanzé (parmi 4 images)","CHIMPANZE","A04X_CHIMPANZE",null,null,"donnée","dico","","E4A_EC_FORMAT2F","Détecter l'image correspondante à chimpanzé (parmi 4 images)","","4 ans","auto-questionnaire école","questionnaire enfant","mode de garde, scolarisation","développement psychomoteur","","","","vocabulaire",""]
[null,null,null,"Détecter l'image correspondant à tulipe (parmi 4 images)","TULIPE","A04X_TULIPE",null,null,"donnée","dico","","E4A_EC_FORMAT2F","Détecter l'image correspondante à tulipe (parmi 4 images)","","4 ans","auto-questionnaire école","questionnaire enfant","mode de garde, scolarisation","développement psychomoteur","","","","vocabulaire",""]
[null,null,null,"Détecter l'image correspondant à cintre (parmi 4 images)","CINTRE","A04X_CINTRE",null,null,"donnée","dico","","E4A_EC_FORMAT2F","Détecter l'image correspondante à cintre (parmi 4 images)","","4 ans","auto-questionnaire école","questionnaire enfant","mode de garde, scolarisation","développement psychomoteur","","","","vocabulaire",""]
[null,null,null,"Détecter l'image correspondant à chou (parmi 4 images)","CHOU","A04X_CHOU",null,null,"donnée","dico","","E4A_EC_FORMAT2F","Détecter l'image correspondante à chou (parmi 4 images)","","4 ans","auto-questionnaire école","questionnaire enfant","mode de garde, scolarisation","développement psychomoteur","","","","vocabulaire","",0]
[null,null,null,"PÉRIODE DE RÉALISATION",null,null,null,null,null,null,null,null,null,null,null,null,null,null,null,null,null,null,null,null,1]
[null,null,null,"Réalisation des exercices en avril 2016","EXOAVRIL","A04X_EXOAVRIL",null,null,"donnée","dico","","E4A_EC_FORMAT4F","Réalisation des exercices en avril 2016","","4 ans","auto-questionnaire école","questionnaire enfant","mode de garde, scolarisation","développement psychomoteur","","","","période de réalisation",""]
[null,null,null,"Réalisation des exercices en mai 2016","EXOMAI","A04X_EXOMAI",null,null,"donnée","dico","","E4A_EC_FORMAT4F","Réalisation des exercices en mai 2016","","4 ans","auto-questionnaire école","questionnaire enfant","mode de garde, scolarisation","développement psychomoteur","","","","période de réalisation",""]
[null,null,null,"Réalisation des exercices en juin 2016","EXOJUIN","A04X_EXOJUIN",null,null,"donnée","dico","","E4A_EC_FORMAT4F","Réalisation des exercices en juin 2016","","4 ans","auto-questionnaire école","questionnaire enfant","mode de garde, scolarisation","développement psychomoteur","","","","période de réalisation","",0]
[null,null,null,"ATTENTION VISUELLE",null,null,null,null,null,null,null,null,null,null,null,null,null,null,null,null,null,null,null,null,1]
[null,null,null,"Prend la valeur 0 si le score brut (nounours15) est inférieur à 12 nounours barrés","NOUNOUR","A04X_NOUNOUR",null,null,"donnée","num","","","Attention visuelle : score dichotomisé","","4 ans","auto-questionnaire école","questionnaire enfant","mode de garde, scolarisation","développement psychomoteur","","","","attention visuelle",""]
[null,null,null,"Prend la valeur 0 si un dessin autre qu'un nounours a été barré (nounours)","NOUNDIS","A04X_NOUNDIS",null,null,"donnée","num","","","Attention visuelle : distracteur","","4 ans","auto-questionnaire école","questionnaire enfant","mode de garde, scolarisation","développement psychomoteur","","","","attention visuelle","",0]
[null,null,null,"QUESTIONNAIRE ENSEIGNANT",null,null,null,null,null,null,null,null,null,null,null,null,null,null,null,null,null,null,null,null,1]
[null,null,null,"À quel niveau est scolarisé l'enfant elfe ?","SCOL","A04X_SCOL",null,null,"donnée","dico","","E4A_EC_FORMAT5S","A quel niveau est scolarisé l'enfant elfe ?","","4 ans","auto-questionnaire école","questionnaire enseignant","mode de garde, scolarisation","développement psychomoteur","","","","questionnaire enseignant",""]
[null,null,null,"À quel niveau est scolarisé l'enfant elfe ? préciser","SCOLP","A04X_SCOLP",null,null,"non-disponible","text","","","A quel niveau est scolarisé l'enfant elfe ? préciser","","4 ans","auto-questionnaire école","questionnaire enseignant","mode de garde, scolarisation","développement psychomoteur","","","","questionnaire enseignant",""]
[null,null,null,"Selon votre expérience professionnelle, comment évaluez-vous les compétences de l'enfant par rapport aux enfants de son âge (et pas seulement les enfants de votre classe ou de l'école), dans les activités de langage","LANGAGE","A04X_LANGAGE",null,null,"donnée","dico","","E4A_EC_FORMAT6S","Selon votre expérience professionnelle, comment évaluez-vous les compétences de l’enfant par rapport aux enfants de son âge (et pas seulement les enfants de votre classe ou de l’école)","","4 ans","auto-questionnaire école","questionnaire enseignant","mode de garde, scolarisation","développement psychomoteur","","","","questionnaire enseignant",""]
[null,null,null,"Selon votre expérience professionnelle, comment évaluez-vous les compétences de l'enfant par rapport aux enfants de son âge (et pas seulement les enfants de votre classe ou de l'école), dans les activités physiques","ACTIPHYS","A04X_ACTIPHYS",null,null,"donnée","dico","","E4A_EC_FORMAT6S","Selon votre expérience professionnelle, comment évaluez-vous les compétences de l’enfant par rapport aux enfants de son âge (et pas seulement les enfants de votre classe ou de l’école)","","4 ans","auto-questionnaire école","questionnaire enseignant","mode de garde, scolarisation","développement psychomoteur","","","","questionnaire enseignant",""]
[null,null,null,"Selon votre expérience professionnelle, comment évaluez-vous les compétences de l'enfant par rapport aux enfants de son âge (et pas seulement les enfants de votre classe ou de l'école), dans les activités artistiques","ACTIARTIS","A04X_ACTIARTIS",null,null,"donnée","dico","","E4A_EC_FORMAT6S","Selon votre expérience professionnelle, comment évaluez-vous les compétences de l’enfant par rapport aux enfants de son âge (et pas seulement les enfants de votre classe ou de l’école)","","4 ans","auto-questionnaire école","questionnaire enseignant","mode de garde, scolarisation","développement psychomoteur","","","","questionnaire enseignant",""]
[null,null,null,"Selon votre expérience professionnelle, comment évaluez-vous les compétences de l'enfant par rapport aux enfants de son âge (et pas seulement les enfants de votre classe ou de l'école), dans les activités sur les nombres, formes et grandeurs","NOMBFORM","A04X_NOMBFORM",null,null,"donnée","dico","","E4A_EC_FORMAT6S","Selon votre expérience professionnelle, comment évaluez-vous les compétences de l’enfant par rapport aux enfants de son âge (et pas seulement les enfants de votre classe ou de l’école)","","4 ans","auto-questionnaire école","questionnaire enseignant","mode de garde, scolarisation","développement psychomoteur","","","","questionnaire enseignant",""]
[null,null,null,"Selon votre expérience professionnelle, comment évaluez-vous les compétences de l'enfant par rapport aux enfants de son âge (et pas seulement les enfants de votre classe ou de l'école), dans les activités sur le temps, l'espace, le vivant, la matière","TEMPESPA","A04X_TEMPESPA",null,null,"donnée","dico","","E4A_EC_FORMAT6S","Selon votre expérience professionnelle, comment évaluez-vous les compétences de l’enfant par rapport aux enfants de son âge (et pas seulement les enfants de votre classe ou de l’école)","","4 ans","auto-questionnaire école","questionnaire enseignant","mode de garde, scolarisation","développement psychomoteur","","","","questionnaire enseignant",""]
[null,null,null,"En vous basant sur les six derniers mois et pour chacun des items, indiquer s'il s'applique au comportement de l'enfant : attentif aux autres","ATTENTA","A04X_ATTENTA",null,null,"donnée","dico","","E4A_EC_FORMAT7S","En vous basant sur les six derniers mois et pour chacun des items ci-dessous, indiquer s’il s’applique au comportement de l’enfant","","4 ans","auto-questionnaire école","questionnaire enseignant","mode de garde, scolarisation","développement psychomoteur","","","","questionnaire enseignant",""]
[null,null,null,"En vous basant sur les six derniers mois et pour chacun des items, indiquer s'il s'applique au comportement de l'enfant : se plaint souvent","PLAINT","A04X_PLAINT",null,null,"donnée","dico","","E4A_EC_FORMAT7S","En vous basant sur les six derniers mois et pour chacun des items ci-dessous, indiquer s’il s’applique au comportement de l’enfant","","4 ans","auto-questionnaire école","questionnaire enseignant","mode de garde, scolarisation","développement psychomoteur","","","","questionnaire enseignant",""]
[null,null,null,"En vous basant sur les six derniers mois et pour chacun des items, indiquer s'il s'applique au comportement de l'enfant : partage facilement","PARTAG","A04X_PARTAG",null,null,"donnée","dico","","E4A_EC_FORMAT7S","En vous basant sur les six derniers mois et pour chacun des items ci-dessous, indiquer s’il s’applique au comportement de l’enfant","","4 ans","auto-questionnaire école","questionnaire enseignant","mode de garde, scolarisation","développement psychomoteur","","","","questionnaire enseignant",""]
[null,null,null,"En vous basant sur les six derniers mois et pour chacun des items, indiquer s'il s'applique au comportement de l'enfant : est obéissant","OBEIS","A04X_OBEIS",null,null,"donnée","dico","","E4A_EC_FORMAT7S","En vous basant sur les six derniers mois et pour chacun des items ci-dessous, indiquer s’il s’applique au comportement de l’enfant","","4 ans","auto-questionnaire école","questionnaire enseignant","mode de garde, scolarisation","développement psychomoteur","","","","questionnaire enseignant",""]
[null,null,null,"En vous basant sur les six derniers mois et pour chacun des items, indiquer s'il s'applique au comportement de l'enfant : s'inquiète souvent","INQUIE","A04X_INQUIE",null,null,"donnée","dico","","E4A_EC_FORMAT7S","En vous basant sur les six derniers mois et pour chacun des items ci-dessous, indiquer s’il s’applique au comportement de l’enfant","","4 ans","auto-questionnaire école","questionnaire enseignant","mode de garde, scolarisation","développement psychomoteur","","","","questionnaire enseignant",""]
[null,null,null,"En vous basant sur les six derniers mois et pour chacun des items, indiquer s'il s'applique au comportement de l'enfant : ne tient pas en place","NTIENTP","A04X_NTIENTP",null,null,"donnée","dico","","E4A_EC_FORMAT7S","En vous basant sur les six derniers mois et pour chacun des items ci-dessous, indiquer s’il s’applique au comportement de l’enfant","","4 ans","auto-questionnaire école","questionnaire enseignant","mode de garde, scolarisation","développement psychomoteur","","","","questionnaire enseignant",""]
[null,null,null,"En vous basant sur les six derniers mois et pour chacun des items, indiquer s'il s'applique au comportement de l'enfant : a un(e) ami€","AAMI","A04X_AAMI",null,null,"donnée","dico","","E4A_EC_FORMAT7S","En vous basant sur les six derniers mois et pour chacun des items ci-dessous, indiquer s’il s’applique au comportement de l’enfant","","4 ans","auto-questionnaire école","questionnaire enseignant","mode de garde, scolarisation","développement psychomoteur","","","","questionnaire enseignant",""]
[null,null,null,"En vous basant sur les six derniers mois et pour chacun des items, indiquer s'il s'applique au comportement de l'enfant : facilement distrait","DISTRA","A04X_DISTRA",null,null,"donnée","dico","","E4A_EC_FORMAT7S","En vous basant sur les six derniers mois et pour chacun des items ci-dessous, indiquer s’il s’applique au comportement de l’enfant","","4 ans","auto-questionnaire école","questionnaire enseignant","mode de garde, scolarisation","développement psychomoteur","","","","questionnaire enseignant",""]
[null,null,null,"En vous basant sur les six derniers mois et pour chacun des items, indiquer s'il s'applique au comportement de l'enfant : anxieux","ANXIEU","A04X_ANXIEU",null,null,"donnée","dico","","E4A_EC_FORMAT7S","En vous basant sur les six derniers mois et pour chacun des items ci-dessous, indiquer s’il s’applique au comportement de l’enfant","","4 ans","auto-questionnaire école","questionnaire enseignant","mode de garde, scolarisation","développement psychomoteur","","","","questionnaire enseignant",""]
[null,null,null,"En vous basant sur les six derniers mois et pour chacun des items, indiquer s'il s'applique au comportement de l'enfant :prêt à aider les autres","AIDE","A04X_AIDE",null,null,"donnée","dico","","E4A_EC_FORMAT7S","En vous basant sur les six derniers mois et pour chacun des items ci-dessous, indiquer s’il s’applique au comportement de l’enfant","","4 ans","auto-questionnaire école","questionnaire enseignant","mode de garde, scolarisation","développement psychomoteur","","","","questionnaire enseignant",""]
[null,null,null,"En vous basant sur les six derniers mois et pour chacun des items, indiquer s'il s'applique au comportement de l'enfant : réfléchit avant d'agir","REFLECHI","A04X_REFLECHI",null,null,"donnée","dico","","E4A_EC_FORMAT7S","En vous basant sur les six derniers mois et pour chacun des items ci-dessous, indiquer s’il s’applique au comportement de l’enfant","","4 ans","auto-questionnaire école","questionnaire enseignant","mode de garde, scolarisation","développement psychomoteur","","","","questionnaire enseignant",""]
[null,null,null,"En vous basant sur les six derniers mois et pour chacun des items, indiquer s'il s'applique au comportement de l'enfant : va jusqu'au bout des tâches","ATTENTI","A04X_ATTENTI",null,null,"donnée","dico","","E4A_EC_FORMAT7S","En vous basant sur les six derniers mois et pour chacun des items ci-dessous, indiquer s’il s’applique au comportement de l’enfant","","4 ans","auto-questionnaire école","questionnaire enseignant","mode de garde, scolarisation","développement psychomoteur","","","","questionnaire enseignant",""]
[null,null,null,"Quels sont les jours d'école ?","RYTHME","A04X_RYTHME",null,null,"donnée","dico","","E4A_EC_FORMAT8S","Quels sont les jours d’école ?","","4 ans","auto-questionnaire école","questionnaire enseignant","mode de garde, scolarisation","développement psychomoteur","","","","questionnaire enseignant",""]
[null,null,null,"Quel est l'effectif de votre classe ?","NBELEVES","A04X_NBELEVES",null,null,"donnée","num","","","Quel est l’effectif de votre classe ?","","4 ans","auto-questionnaire école","questionnaire enseignant","mode de garde, scolarisation","développement psychomoteur","","","","questionnaire enseignant",""]
[null,null,null,"S'agit-il d'une classe simple ou à plusieurs niveaux ?","NIVECLASS","A04X_NIVECLASS",null,null,"donnée","dico","","E4A_EC_FORMAT9S","S’agit-il d’une classe simple ou à plusieurs niveaux ?","","4 ans","auto-questionnaire école","questionnaire enseignant","mode de garde, scolarisation","développement psychomoteur","","","","questionnaire enseignant",""]
[null,null,null,"S'agit-il d'une classe simple ou à plusieurs niveaux ? préciser","NIVECLASSP","A04X_NIVECLASSP",null,null,"non-disponible","text","","","S’agit-il d’une classe simple ou à plusieurs niveaux ? préciser","","4 ans","auto-questionnaire école","questionnaire enseignant","mode de garde, scolarisation","développement psychomoteur","","","","questionnaire enseignant",""]
[null,null,null,"En classe ou à la maison, vos élèves utilisent-ils un manuel ou logiciel d'apprentissage pour les activités sur le langage ?","LANGMAN","A04X_LANGMAN",null,null,"donnée","dico","","E4A_EC_FORMAT10S","En classe ou à la maison, vos élèves utilisent-ils un manuel ou logiciel d'apprentissage pour les activités sur le langage ?","","4 ans","auto-questionnaire école","questionnaire enseignant","","","","","","questionnaire enseignant",""]
[null,null,null,"Éditeur, titre ou nom (manuel ou logiciel d'apprentissage activités sur le langage) : préciser les plus utilisés (2)","LANGMANP","A04X_LANGMANP",null,null,"non-disponible","text","","","Editeur, titre ou nom (manuel ou logiciel d'apprentissage activités sur le langage) : préciser les plus utilisés (2)","","4 ans","auto-questionnaire école","questionnaire enseignant","","","","","","questionnaire enseignant",""]
[null,null,null,"En classe ou à la maison, vos élèves utilisent-ils des textes photocopiés pour les activités sur le langage ?","LANGPHO","A04X_LANGPHO",null,null,"donnée","dico","","E4A_EC_FORMAT10S","En classe ou à la maison, vos élèves utilisent-ils des textes photocopiés pour les activités sur le langage ?","","4 ans","auto-questionnaire école","questionnaire enseignant","","","","","","questionnaire enseignant",""]
[null,null,null,"Éditeur, titre ou nom (textes photocopiés activités sur le langage) : préciser les plus utilisés (2)","LANGPHOP","A04X_LANGPHOP",null,null,"non-disponible","text","","","Editeur, titre ou nom (textes photocopiés activités sur le langage) : préciser les plus utilisés (2)","","4 ans","auto-questionnaire école","questionnaire enseignant","","","","","","questionnaire enseignant",""]
[null,null,null,"En classe ou à la maison, vos élèves utilisent-ils un cahier d'activités ou d'exercices ou logiciel d'exercices pour les activités sur le langage ?","LANGEXO","A04X_LANGEXO",null,null,"donnée","dico","","E4A_EC_FORMAT10S","En classe ou à la maison, vos élèves utilisent-ils un cahier d'activités ou d'exercices ou logiciel d'exercices pour les activités sur le langage ?","","4 ans","auto-questionnaire école","questionnaire enseignant","","","","","","questionnaire enseignant",""]
[null,null,null,"Éditeur, titre ou nom (cahier d'activités ou logiciel exercices activités sur le langage) : préciser les plus utilisés (2)","LANGEXOP","A04X_LANGEXOP",null,null,"non-disponible","text","","","Editeur, titre ou nom (cahier d'activités ou logiciel exercices activités sur le langage) : : préciser les plus utilisés (2)","","4 ans","auto-questionnaire école","questionnaire enseignant","","","","","","questionnaire enseignant",""]
[null,null,null,"En classe ou à la maison, vos élèves utilisent-ils un manuel ou logiciel d'apprentissage pour les activités sur les nombres, formes et grandeurs ?","SCIENMAN","A04X_SCIENMAN",null,null,"donnée","dico","","E4A_EC_FORMAT10S","En classe ou à la maison, vos élèves utilisent-ils un manuel ou logiciel d'apprentissage pour les activités sur les nombres, formes et grandeurs ?","","4 ans","auto-questionnaire école","questionnaire enseignant","","","","","","questionnaire enseignant",""]
[null,null,null,"Éditeur, titre ou nom (manuel ou logiciel d'apprentissage activités nombres, formes et grandeurs) : préciser les plus utilisés (2)","SCIENMANP","A04X_SCIENMANP",null,null,"non-disponible","text","","","Editeur, titre ou nom (manuel ou logiciel d'apprentissage activités nombres, formes et grandeurs) : préciser les plus utilisés (2)","","4 ans","auto-questionnaire école","questionnaire enseignant","","","","","","questionnaire enseignant",""]
[null,null,null,"En classe ou à la maison, vos élèves utilisent-ils des textes photocopiés pour les activités sur les nombres, formes et grandeurs ?","SCIENPHO","A04X_SCIENPHO",null,null,"donnée","dico","","E4A_EC_FORMAT10S","En classe ou à la maison, vos élèves utilisent-ils des textes photocopiés pour les activités sur les nombres, formes et grandeurs ?","","4 ans","auto-questionnaire école","questionnaire enseignant","","","","","","questionnaire enseignant",""]
[null,null,null,"Éditeur, titre ou nom (textes photocopiés activités nombres, formes et grandeurs) : préciser les plus utilisés (2)","SCIENPHOP","A04X_SCIENPHOP",null,null,"non-disponible","text","","","Editeur, titre ou nom (textes photocopiés activités nombres, formes et grandeurs) : : préciser les plus utilisés (2)","","4 ans","auto-questionnaire école","questionnaire enseignant","","","","","","questionnaire enseignant",""]
[null,null,null,"En classe ou à la maison, vos élèves utilisent-ils un cahier d'activités ou d'exercices ou logiciel d'exercices pour les activités sur les nombres, formes et grandeurs ?","SCIENEXO","A04X_SCIENEXO",null,null,"donnée","dico","","E4A_EC_FORMAT10S","En classe ou à la maison, vos élèves utilisent-ils un cahier d'activités ou d'exercices ou logiciel d'exercices pour les activités sur les nombres, formes et grandeurs ?","","4 ans","auto-questionnaire école","questionnaire enseignant","","","","","","questionnaire enseignant",""]
[null,null,null,"Éditeur, titre ou nom (cahier d'activités ou logiciel exercices activités nombres, formes et grandeurs) : préciser les plus utilisés (2)","SCIENEXOP","A04X_SCIENEXOP",null,null,"non-disponible","text","","","Editeur, titre ou nom (cahier d'activités ou logiciel exercices activités nombres, formes et grandeurs) : préciser les plus utilisés (2)","","4 ans","auto-questionnaire école","questionnaire enseignant","","","","","","questionnaire enseignant",""]
[null,null,null,"Vous-même utilisez-vous des outils pour préparer vos leçons pour les activités sur le langage","ENSLANG","A04X_ENSLANG",null,null,"donnée","dico","","E4A_EC_FORMAT10S","Vous-même utilisez-vous des outils pour préparer vos leçons pour les activités sur le langage","","4 ans","auto-questionnaire école","questionnaire enseignant","","","","","","questionnaire enseignant",""]
[null,null,null,"Éditeur, titre ou nom (livre du maître, ouvrage de référence, autre manuel, logiciel ou site internet activités sur le langage) : préciser les plus utilisés (2)","ENSLANGP","A04X_ENSLANGP",null,null,"non-disponible","text","","","Editeur, titre ou nom (livre du maître, ouvrage de référence, autre manuel, logiciel ou site internet activités sur le langage) : préciser les plus utilisés (2)","","4 ans","auto-questionnaire école","questionnaire enseignant","","","","","","questionnaire enseignant",""]
[null,null,null,"Vous-même utilisez-vous des outils pour préparer vos leçons pour les activités sur les nombres, formes et grandeurs","ENSSCIEN","A04X_ENSSCIEN",null,null,"donnée","dico","","E4A_EC_FORMAT10S","Vous-même utilisez-vous des outils pour préparer vos leçons pour les activités sur les nombres, formes et grandeurs","","4 ans","auto-questionnaire école","questionnaire enseignant","","","","","","questionnaire enseignant",""]
[null,null,null,"Éditeur, titre ou nom (livre du maître, ouvrage de référence, autre manuel, logiciel ou site internet activités nombres, formes et grandeurs) : préciser les plus utilisés (2)","ENSSCIENP","A04X_ENSSCIENP",null,null,"non-disponible","text","","","Editeur, titre ou nom (livre du maître, ouvrage de référence, autre manuel, logiciel ou site internet activités nombres, formes et grandeurs) : préciser les plus utilisés (2)","","4 ans","auto-questionnaire école","questionnaire enseignant","","","","","","questionnaire enseignant",""]
[null,null,null,"Sexe de l'enseignant","ENSSEXE","A04X_ENSSEXE",null,null,"donnée","dico","","E4A_EC_ENSEXE","Sexe de l'enseignant","","4 ans","auto-questionnaire école","questionnaire enseignant","","","","","","questionnaire enseignant",""]
[null,null,null,"Âge de l'enseignant","ENSAGE","A04X_ENSAGE",null,null,"donnée","num","","","Age de l'enseignant","","4 ans","auto-questionnaire école","questionnaire enseignant","","","","","","questionnaire enseignant",""]
[null,null,null,"Êtes-vous l'enseignant habituel de cette classe ?","ENSHABIT","A04X_ENSHABIT",null,null,"donnée","dico","","E4A_EC_FORMAT11S","Etes-vous l'enseignant habituel de cette classe?","","4 ans","auto-questionnaire école","questionnaire enseignant","","","","","","questionnaire enseignant",""]
[null,null,null,"Depuis combien d'années enseignez-vous à ce niveau scolaire (y compris cette année) ?","ENSDUREE","A04X_ENSDUREE",null,null,"donnée","num","","","Depuis combien d’années enseignez-vous à ce niveau scolaire (y compris cette année) ?","","4 ans","auto-questionnaire école","questionnaire enseignant","","","","","","questionnaire enseignant",""]
[null,null,null,"Êtes-vous titulaire, stagiaire ou contractuel ?","ENSSTATUT","A04X_ENSSTATUT",null,null,"donnée","dico","","E4A_EC_FORMAT12S","Etes-vous titulaire, stagiaire ou contractuel ?","","4 ans","auto-questionnaire école","questionnaire enseignant","","","","","","questionnaire enseignant",""]
[null,null,null,"Faites-vous partie d'associations ou de mouvements pédagogiques ?","ENSASSOC","A04X_ENSASSOC",null,null,"donnée","dico","","E4A_EC_FORMAT10S","Faites-vous partie d’associations ou de mouvements pédagogiques ?","","4 ans","auto-questionnaire école","questionnaire enseignant","","","","","","questionnaire enseignant",""]
[null,null,null,"Faites-vous partie d'associations ou de mouvements pédagogiques ? préciser","ENSASSOCP","A04X_ENSASSOCP",null,null,"non-disponible","text","","","Faites-vous partie d’associations ou de mouvements pédagogiques ? préciser","","4 ans","auto-questionnaire école","questionnaire enseignant","","","","","","questionnaire enseignant",""]
[null,null,null,"Quel est votre diplôme le plus élevé ? baccalauréat","ENSDIPLOME1","A04X_ENSDIPLOME1",null,null,"donnée","dico","","E4A_EC_FORMAT4F","Quel est votre diplôme le plus élevé ? baccalauréat","","4 ans","auto-questionnaire école","questionnaire enseignant","","","","","","questionnaire enseignant",""]
[null,null,null,"Quel est votre diplôme le plus élevé ? deug","ENSDIPLOME2","A04X_ENSDIPLOME2",null,null,"donnée","dico","","E4A_EC_FORMAT4F","Quel est votre diplôme le plus élevé ? deug","","4 ans","auto-questionnaire école","questionnaire enseignant","","","","","","questionnaire enseignant",""]
[null,null,null,"Quel est votre diplôme le plus élevé ? licence","ENSDIPLOME3","A04X_ENSDIPLOME3",null,null,"donnée","dico","","E4A_EC_FORMAT4F","Quel est votre diplôme le plus élevé ? licence","","4 ans","auto-questionnaire école","questionnaire enseignant","","","","","","questionnaire enseignant",""]
[null,null,null,"Quel est votre diplôme le plus élevé ? maîtrise ou master 1","ENSDIPLOME4","A04X_ENSDIPLOME4",null,null,"donnée","dico","","E4A_EC_FORMAT4F","Quel est votre diplôme le plus élevé ? maitrise ou master 1","","4 ans","auto-questionnaire école","questionnaire enseignant","","","","","","questionnaire enseignant",""]
[null,null,null,"Quel est votre diplôme le plus élevé ? dea, dess ou master 2","ENSDIPLOME5","A04X_ENSDIPLOME5",null,null,"donnée","dico","","E4A_EC_FORMAT4F","Quel est votre diplôme le plus élevé ? dea, dess ou master 2","","4 ans","auto-questionnaire école","questionnaire enseignant","","","","","","questionnaire enseignant",""]
[null,null,null,"Quel est votre diplôme le plus élevé ? autre","ENSDIPLOME6","A04X_ENSDIPLOME6",null,null,"donnée","dico","","E4A_EC_FORMAT4F","Quel est votre diplôme le plus élevé ? autre","","4 ans","auto-questionnaire école","questionnaire enseignant","","","","","","questionnaire enseignant",""]
[null,null,null,"Quel est votre diplôme le plus élevé ? préciser","ENSDIPLOME6P","A04X_ENSDIPLOME6P",null,null,"non-disponible","text","","","Quel est votre diplôme le plus élevé ? préciser","","4 ans","auto-questionnaire école","questionnaire enseignant","","","","","","questionnaire enseignant",""]
[null,null,null,"Avant la formation professionnelle, dans quel type de discipline avez-vous fait vos études, principalement ? lettres et langues","ENSDISCI1","A04X_ENSDISCI1",null,null,"donnée","dico","","E4A_EC_FORMAT4F","Avant la formation professionnelle, dans quel type de discipline avez-vous fait vos études, principalement ? lettres et langues","","4 ans","auto-questionnaire école","questionnaire enseignant","","","","","","questionnaire enseignant",""]
[null,null,null,"Avant la formation professionnelle, dans quel type de discipline avez-vous fait vos études, principalement ? sciences humaines","ENSDISCI2","A04X_ENSDISCI2",null,null,"donnée","dico","","E4A_EC_FORMAT4F","Avant la formation professionnelle, dans quel type de discipline avez-vous fait vos études, principalement ? sciences humaines","","4 ans","auto-questionnaire école","questionnaire enseignant","","","","","","questionnaire enseignant",""]
[null,null,null,"Avant la formation professionnelle, dans quel type de discipline avez-vous fait vos études, principalement ? sciences","ENSDISCI3","A04X_ENSDISCI3",null,null,"donnée","dico","","E4A_EC_FORMAT4F","Avant la formation professionnelle, dans quel type de discipline avez-vous fait vos études, principalement ? sciences","","4 ans","auto-questionnaire école","questionnaire enseignant","","","","","","questionnaire enseignant",""]
[null,null,null,"Avant la formation professionnelle, dans quel type de discipline avez-vous fait vos études, principalement ? droit et sciences économiques","ENSDISCI4","A04X_ENSDISCI4",null,null,"donnée","dico","","E4A_EC_FORMAT4F","Avant la formation professionnelle, dans quel type de discipline avez-vous fait vos études, principalement ? droit et sciences économiques","","4 ans","auto-questionnaire école","questionnaire enseignant","","","","","","questionnaire enseignant",""]
[null,null,null,"Avant la formation professionnelle, dans quel type de discipline avez-vous fait vos études, principalement ? autre","ENSDISCI5","A04X_ENSDISCI5",null,null,"donnée","dico","","E4A_EC_FORMAT4F","Avant la formation professionnelle, dans quel type de discipline avez-vous fait vos études, principalement ? autre","","4 ans","auto-questionnaire école","questionnaire enseignant","","","","","","questionnaire enseignant",""]
[null,null,null,"Avant la formation professionnelle, dans quel type de discipline avez-vous fait vos études, principalement ? préciser","ENSDISCI5P","A04X_ENSDISCI5P",null,null,"non-disponible","text","","","Avant la formation professionnelle, dans quel type de discipline avez-vous fait vos études, principalement ? préciser","","4 ans","auto-questionnaire école","questionnaire enseignant","","","","","","questionnaire enseignant","",0]
[null,null,null,"SCORES",null,null,null,null,null,null,null,null,null,null,null,null,null,null,null,null,null,null,null,null,1]
[null,null,null,"Score SDQ : échelle de troubles émotionnels","SCORE_SDQ_EMO_ECOLE_4ANS ","A04X_SCORE_SDQ_EMO_ECOLE_4ANS ",null,null,"donnée","num",null,null,null,null,null,null,null,"questionnaire enseignant","Développement","Ecole",null,null,"questionnaire enseignant"]
[null,null,null,"Score SDQ : échelle d'hyperactivité","SCORE_SDQ_HYPER_4ANS","A04X_SCORE_SDQ_HYPER_4ANS",null,null,"donnée","num",null,null,null,null,null,null,null,"questionnaire enseignant","Développement","Ecole",null,null,"questionnaire enseignant"]
[null,null,null,"Score SDQ : échelle prosocial","SCORE_SDQ_PRO_4ANS","A04X_SCORE_SDQ_PRO_4ANS",null,null,"donnée","num",null,null,null,null,null,null,null,"questionnaire enseignant","Développement","Ecole",null,null,"questionnaire enseignant"]
[null,null,null,"Catégories score (normal, limite, anormal) : Troubles émotionnels","SCORE_CAT_SDQ_EMO_4ANS ","A04X_SCORE_CAT_SDQ_EMO_4ANS ",null,null,"donnée","dico",null,"SDQ_ECOLEA",null,null,null,null,null,"questionnaire enseignant","Développement","Ecole",null,null,"questionnaire enseignant"]
[null,null,null,"Catégories score (normal, limite, anormal) : Hyperactivité\"","SCORE_CAT_SDQ_HYPER_4ANS ","A04X_SCORE_CAT_SDQ_HYPER_4ANS ",null,null,"donnée","dico",null,"SDQ_ECOLEA",null,null,null,null,null,"questionnaire enseignant","Développement","Ecole",null,null,"questionnaire enseignant"]
[null,null,null,"Catégories score (normal, limite, anormal) : Comportement prosocial\"","SCORE_CAT_SDQ_PRO_4ANS ","A04X_SCORE_CAT_SDQ_PRO_4ANS ",null,null,"donnée","dico",null,"SDQ_ECOLEA",null,null,null,null,null,"questionnaire enseignant","Développement","Ecole",null,null,"questionnaire enseignant"]
[null,null,null,"Score de connaissance des chiffres","SCchiffre","A04X_SCchiffre",null,null,"donnée","num",null,null,null,null,null,null,null,"questionnaire enfant","Ecole"]
[null,null,null,"Score au test de reconnaissance de lettres","SClet","A04X_SClet",null,null,"donnée","num",null,null,null,null,null,null,null,"questionnaire enfant","Ecole"]
[null,null,null,"Score moyen pour l’ensemble des compétences de lecture","SCmoylect","A04X_SCmoylect",null,null,"donnée","num",null,null,null,null,null,null,null,"questionnaire enfant","Ecole"]
[null,null,null,"Score moyen pour l’ensemble des compétences de lecture avec tests de phonologie regroupés","SCmoylect2","A04X_SCmoylect2",null,null,"donnée","num",null,null,null,null,null,null,null,"questionnaire enfant","Ecole"]
[null,null,null,"Score moyen de maths en maternelle","SCmoymath","A04X_SCmoymath",null,null,"donnée","num",null,null,null,null,null,null,null,"questionnaire enfant","Ecole"]
[null,null,null,"Score de numération intuitive","SCnumint","A04X_SCnumint",null,null,"donnée","num",null,null,null,null,null,null,null,"questionnaire enfant","Ecole"]
[null,null,null,"Score au test d’habilité phonologique (détection d’intrus)","SCphon1","A04X_SCphon1",null,null,"donnée","num",null,null,null,null,null,null,null,"questionnaire enfant","Ecole"]
[null,null,null,"Score au test d’habilité phonologique (suppression syllabique)","SCphon2","A04X_SCphon2",null,null,"donnée","num",null,null,null,null,null,null,null,"questionnaire enfant","Ecole"]
[null,null,null,"Score au test d’habilité phonologique (détection d’intrus et suppression syllabiques regroupés)","SCphon3","A04X_SCphon3",null,null,"donnée","num",null,null,null,null,null,null,null,"questionnaire enfant","Ecole"]
[null,null,null,"Score au test de vocabulaire","SCvoca","A04X_SCvoca",null,null,"donnée","num",null,null,null,null,null,null,null,"questionnaire enfant","Ecole",null,null,null,null,null,0]

{"sheet":"E6A_ECOLE","index":6,"n_rows":279,"n_cols":76,"rows_kept":279,"cut":false,"hidden":false,"merged":[]}
["SELECTION\n(par variable ou par section)","SELECTION\n(par thème 1)","SELECTION\n(par QUEST STANDARD)","LABEL","QUESTION QUESTIONNAIRE","QUESTION BASE","QUESTION BASE",null,"TYPE","FORMAT","CHAPEAU","DICO","DESCRIPTION","CONTRÔLE","THEME(01)","THEME(02)","THEME(03)","THEME1","THEME2","THEME3","THEME4","THEME5","THEME6","QUEST STANDARD","THEME_TITRE","","","","","","","","","","","","","","","","","","","","","","","","","","","E6A_ECOLE","E6A_ECOLE","","","","","","","","","","","","","","","","","","","","","","",""]
[null,null,null,{"$f":"CONCATENATE(\"Sélection totale : \",COUNTIFS(A:A,\"X\",I:I,\"*\")+COUNTIFS(B:B,\"X\",I:I,\"*\")+COUNTIFS(C:C,\"X\",I:I,\"*\"),\" variable(s)\")","v":"Sélection totale : 0 variable(s)"},null,null,null,null,null,null,null,null,null,null,null,null,null,null,null,null,null,null,null,null,null,null,{"$f":"COUNTIFS(A:A,\"X\",I:I,\"non-disponible\")+COUNTIFS(B:B,\"X\",I:I,\"non-disponible\")+COUNTIFS(C:C,\"X\",I:I,\"non-disponible\")","v":0},{"$f":"SUM(COUNTIFS($A:$A,\"X\",$E:$E,{\"ACRELI\";\"ACCHRET\";\"ACMUSUL\";\"LRELI\";\"QLCHRET\";\"QLMUSUL\";\"POLIT\"})+COUNTIFS($B:$B,\"X\",$E:$E,{\"ACRELI\";\"ACCHRET\";\"ACMUSUL\";\"LRELI\";\"QLCHRET\";\"QLMUSUL\";\"POLIT\"})+COUNTIFS($C:$C,\"X\",$E:$E,{\"ACRELI\";\"ACCHRET\";\"ACMUSUL\";\"LRELI\";\"QLCHRET\";\"QLMUSUL\";\"POLIT\"}))","v":0}]
[null,null,null,"GESTION",null,null,null,null,null,null,null,null,null,null,null,null,null,null,null,null,null,null,null,null,1]
[null,null,null,"Nombre de réponses aux exercices","NBREPENF","A06X_NBREPENF",null,null,"donnée",null,null,"","Nombre de réponses aux exercices",null,"","7ans","auto-questionnaire ecole","gestion","","","","","",null,null,""]
[null,null,null,"Nombre de réponses au questionnaire enseignant","NBREPENS","A06X_NBREPENS",null,null,"donnée",null,null,"","Nombre de réponses au questionnaire enseignant",null,"","7ans","auto-questionnaire ecole","gestion","","","","","",null,null,""]
[null,null,null,"Numéro de l'enfant (enfant elfe=1)","ENFELFE","A06X_ENFELFE",null,null,"donnée",null,null,"","Numéro de l'enfant (enfant elfe=1)",null,"","7ans","auto-questionnaire ecole","gestion","","","","","",null,null,""]
[null,null,null,"Nombre d'enfants ayant réalisé les exercices (nombre de colonnes renseignées)","NBENFQUEST","A06X_NBENFQUEST",null,null,"donnée",null,null,"","Nombre d'enfants ayant réalisé les exercices (nombre de colonnes renseignées)",null,"","7ans","auto-questionnaire ecole","gestion","","","","","",null,0,""]
[null,null,null,"ÉCOLE",null,null,null,null,null,null,null,null,null,null,null,null,null,null,null,null,null,null,null,null,1]
[null,null,null,"Numéro de vague","VAGUE","A06X_VAGUE",null,null,"donnée",null,null,"E7A_EC_VAGUE","Numéro de vague",null,"","7ans","auto-questionnaire ecole","gestion","","","","","",null,null,""]
[null,null,null,"7 ans école : eligibilité","ELIG","A06X_ELIG",null,null,"donnée",null,null,"E7A_EC_GESTELIG","7 ans école : eligibilité",null,"","7ans","auto-questionnaire ecole","gestion","","","","","",null,null,""]
[null,null,null,"7 ans école : motif de non éligibilité","ELIG2MOT","A06X_ELIG2MOT",null,null,"donnée",null,null,"E7A_EC_GESTELIG2MOT","7 ans école : motif de non éligibilité",null,"","7ans","auto-questionnaire ecole","gestion","","","","","",null,null,""]
[null,null,null,"7 ans école : motif de non éligibilité (précision)","ELIG2MOT8PR","A06X_ELIG2MOT8PR",null,null,"non-disponible",null,null,"","7 ans école : motif de non éligibilité (précision)",null,"","7ans","auto-questionnaire ecole","gestion","","","","","",null,null,""]
[null,null,null,"7 ans école : prise de contact","IN","A06X_IN",null,null,"donnée",null,null,"E7A_EC_GESTIN","7 ans école : prise de contact",null,"","7ans","auto-questionnaire ecole","gestion","","","","","",null,null,""]
[null,null,null,"7 ans école : motif de non prise de contact","IN2MOT","A06X_IN2MOT",null,null,"donnée",null,null,"E7A_EC_GESTIN2MOT","7 ans école : motif de non prise de contact",null,"","7ans","auto-questionnaire ecole","gestion","","","","","",null,null,""]
[null,null,null,"7 ans école : motif de non prise de contact (précision)","IN2MOT8PR","A06X_IN2MOT8PR",null,null,"non-disponible",null,null,"","7 ans école : motif de non prise de contact (précision)",null,"","7ans","auto-questionnaire ecole","gestion","","","","","",null,null,""]
[null,null,null,"7 ans école : retour de collecte","OUT","A06X_OUT",null,null,"donnée",null,null,"E7A_EC_GESTOUT","7 ans école : retour de collecte",null,"","7ans","auto-questionnaire ecole","gestion","","","","","",null,null,""]
[null,null,null,"7 ans école : motif de non retour de collecte","OUT2MOT","A06X_OUT2MOT",null,null,"donnée",null,null,"E7A_EC_GESTOUT2MOT","7 ans école : motif de non retour de collecte",null,"","7ans","auto-questionnaire ecole","gestion","","","","","",null,null,""]
[null,null,null,"7 ans école : motif de non retour de collecte (précision)","OUT2MOT8PR","A06X_OUT2MOT8PR",null,null,"non-disponible",null,null,"","7 ans école : motif de non retour de collecte (précision)",null,"","7ans","auto-questionnaire ecole","gestion","","","","","",null,null,""]
[null,null,null,"Nombre d'enfants elfe par école","SYSADM","A06X_SYSADM",null,null,"non-disponible",null,null,"E7A_EC_GESTSYSADM","Nombre d'enfants elfe par école",null,"","7ans","auto-questionnaire ecole","gestion","","","","","",null,null,""]
[null,null,null,"7 ans école : réalisation de l'enquête","ENQ","A06X_ENQ",null,null,"donnée",null,null,"E7A_EC_GESTENQ","7 ans école : réalisation de l'enquête",null,"","7ans","auto-questionnaire ecole","gestion","","","","","",null,null,""]
[null,null,null,"Numéro identification école","FINESS","A06X_FINESS",null,null,"non-disponible",null,null,"","Numéro identification école",null,"","7ans","auto-questionnaire ecole","gestion","","","","","",null,null,""]
[null,null,null,"Education prioritaire ","REP","A06X_REPc",null,null,"donnée",null,null,"E7A_EC_REP","Education prioritaire",null,"","7ans","auto-questionnaire ecole","gestion","","","","","",null,null,""]
[null,null,null,"Education prioritaire (plus) ","REPPLUS","A06X_REPPLUSc",null,null,"donnée",null,null,"E7A_EC_REPP","Education prioritaire (plus)",null,"","7ans","auto-questionnaire ecole","gestion","","","","","",null,null,""]
[null,null,null,"Secteur public/privé ","PUBLPRIV","A06X_PUBLPRIVc",null,null,"donnée",null,null,"E7A_EC_PUPR","Secteur public/privé",null,"","7ans","auto-questionnaire ecole","gestion","","","","","",null,null,""]
[null,null,null,"Nombre d'enfants elfe par école","NBENFECOLE","A06X_NBENFECOLE",null,null,"donnée",null,null,"","Nombre d'enfants elfe par école",null,"","7ans","auto-questionnaire ecole","gestion","","","","","",null,null,""]
[null,null,null,"Présence d'un mail","MAIL","A06X_MAIL",null,null,"donnée",null,null,"E7A_EC_YORN","Présence d'un mail",null,"","7ans","auto-questionnaire ecole","gestion","","","","","",null,null,""]
[null,null,null,"Mois de naissance","DATNAISSM","A06X_DATNAISSM",null,null,"non-disponible",null,null,"E7A_EC_DATNAISSM","Mois de naissance",null,"","7ans","auto-questionnaire ecole","etat civil","","","","","",null,null,""]
[null,null,null,"Age en nombre de mois de l'enfant","AGEM","A06X_AGEM",null,null,"donnée",null,null,"","Age en nombre de mois de l'enfant",null,"","7ans","auto-questionnaire ecole","etat civil","","","","","",null,null,""]
[null,null,null,"Age en nombre de jours de l'enfant","AGEJR","A06X_AGEJR",null,null,"non-disponible",null,null,"","Age en nombre de jours de l'enfant",null,"","7ans","auto-questionnaire ecole","etat civil","","","","","",null,null,""]
[null,null,null,"Age en nombre d'années de l'enfant","AGEAN","A06X_AGEAN",null,null,"donnée",null,null,"","Age en nombre d'années de l'enfant",null,"","7ans","auto-questionnaire ecole","etat civil","","","","","",null,null,""]
[null,null,null,"Sexe de l'enfant","SEXE","A06X_SEXE",null,null,"donnée",null,null,"E7A_EC_SEXE","Sexe de l'enfant",null,"","7ans","auto-questionnaire ecole","etat civil","","","","","",null,0,""]
[null,null,null,"EXERCICES DE DÉNOMBREMENT",null,null,null,null,null,null,null,null,null,null,null,null,null,null,null,null,null,null,null,null,1]
[null,null,null,"Additionner (3+7)","CALCUL10","A06X_CALCUL10",null,null,"donnée",null,null,"E7A_EC_FORMAT1F","Additionner (3+7)",null,"","7ans","auto-questionnaire ecole","questionnaire enfant","","","","","","exercices de dénombrement",null,""]
[null,null,null,"Déduire (2+?=5)","CALCUL3","A06X_CALCUL3",null,null,"donnée",null,null,"E7A_EC_FORMAT1F","Déduire (2+?=5)",null,"","7ans","auto-questionnaire ecole","questionnaire enfant","","","","","","exercices de dénombrement",null,""]
[null,null,null,"Soustraire (6-2)","CALCUL4A","A06X_CALCUL4A",null,null,"donnée",null,null,"E7A_EC_FORMAT1F","Soustraire (6-2)",null,"","7ans","auto-questionnaire ecole","questionnaire enfant","","","","","","exercices de dénombrement",null,""]
[null,null,null,"Soustraire (9-8)","CALCUL1","A06X_CALCUL1",null,null,"donnée",null,null,"E7A_EC_FORMAT1F","Soustraire (9-8)",null,"","7ans","auto-questionnaire ecole","questionnaire enfant","","","","","","exercices de dénombrement",null,""]
[null,null,null,"Diviser (8:2)","CALCUL4B","A06X_CALCUL4B",null,null,"donnée",null,null,"E7A_EC_FORMAT1F","Diviser (8:2)",null,"","7ans","auto-questionnaire ecole","questionnaire enfant","","","","","","exercices de dénombrement",null,""]
[null,null,null,"Multiplier (2x9)","CALCUL18","A06X_CALCUL18",null,null,"donnée",null,null,"E7A_EC_FORMAT1F","Multiplier (2x9)",null,"","7ans","auto-questionnaire ecole","questionnaire enfant","","","","","","exercices de dénombrement",null,""]
[null,null,null,"Soustraire (56-50)","CALCUL6","A06X_CALCUL6",null,null,"donnée",null,null,"E7A_EC_FORMAT1F","Soustraire (56-50)",null,"","7ans","auto-questionnaire ecole","questionnaire enfant","","","","","","exercices de dénombrement",null,""]
[null,null,null,"Soustraire (62-10)","CALCUL52","A06X_CALCUL52",null,null,"donnée",null,null,"E7A_EC_FORMAT1F","Soustraire (62-10)",null,"","7ans","auto-questionnaire ecole","questionnaire enfant","","","","","","exercices de dénombrement",null,""]
[null,null,null,"Multiplier (2x4)","PROBLEM8","A06X_PROBLEM8",null,null,"donnée",null,null,"E7A_EC_FORMAT1F","Multiplier (2x4)",null,"","7ans","auto-questionnaire ecole","questionnaire enfant","","","","","","exercices de dénombrement",null,""]
[null,null,null,"Diviser (6:2)","PROBLEM3A","A06X_PROBLEM3A",null,null,"donnée",null,null,"E7A_EC_FORMAT1F","Diviser (6:2)",null,"","7ans","auto-questionnaire ecole","questionnaire enfant","","","","","","exercices de dénombrement",null,""]
[null,null,null,"Déduire (2+?=8)","PROBLEM6","A06X_PROBLEM6",null,null,"donnée",null,null,"E7A_EC_FORMAT1F","Déduire (2+?=8)",null,"","7ans","auto-questionnaire ecole","questionnaire enfant","","","","","","exercices de dénombrement",null,""]
[null,null,null,"Soustraire (25-4)","PROBLEM21","A06X_PROBLEM21",null,null,"donnée",null,null,"E7A_EC_FORMAT1F","Soustraire (25-4)",null,"","7ans","auto-questionnaire ecole","questionnaire enfant","","","","","","exercices de dénombrement",null,""]
[null,null,null,"Additionner (8+17)","PROBLEM25","A06X_PROBLEM25",null,null,"donnée",null,null,"E7A_EC_FORMAT1F","Additionner (8+17)",null,"","7ans","auto-questionnaire ecole","questionnaire enfant","","","","","","exercices de dénombrement",null,""]
[null,null,null,"Déduire (4+?=7)","PROBLEM3B","A06X_PROBLEM3B",null,null,"donnée",null,null,"E7A_EC_FORMAT1F","Déduire (4+?=7)",null,"","7ans","auto-questionnaire ecole","questionnaire enfant","","","","","","exercices de dénombrement",null,""]
[null,null,null,"Additionner (10+10+10+2+2+1)","EURO35","A06X_EURO35",null,null,"donnée",null,null,"E7A_EC_FORMAT1F","Additionner (10+10+10+2+2+1)",null,"","7ans","auto-questionnaire ecole","questionnaire enfant","","","","","","exercices de dénombrement",null,""]
[null,null,null,"Additionner (20+10+5+1)","EURO36","A06X_EURO36",null,null,"donnée",null,null,"E7A_EC_FORMAT1F","Additionner (20+10+5+1)",null,"","7ans","auto-questionnaire ecole","questionnaire enfant","","","","","","exercices de dénombrement",null,""]
[null,null,null,"Additionner (50+10+2)","EURO62","A06X_EURO62",null,null,"donnée",null,null,"E7A_EC_FORMAT1F","Additionner (50+10+2)",null,"","7ans","auto-questionnaire ecole","questionnaire enfant","","","","","","exercices de dénombrement",null,""]
[null,null,null,"Additionner (20+20+5+1+1)","EURO47","A06X_EURO47",null,null,"donnée",null,null,"E7A_EC_FORMAT1F","Additionner (20+20+5+1+1)",null,"","7ans","auto-questionnaire ecole","questionnaire enfant","","","","","","exercices de dénombrement",null,""]
[null,null,null,"Compléter une suite numérique croissante de pas égal à 1","SUITE7","A06X_SUITE7",null,null,"donnée",null,null,"E7A_EC_FORMAT2F","Compléter une suite numérique croissante de pas égal à 1",null,"","7ans","auto-questionnaire ecole","questionnaire enfant","","","","","","exercices de dénombrement",null,""]
[null,null,null,"Compléter une suite numérique croissante de pas égal à 10","SUITE40","A06X_SUITE40",null,null,"donnée",null,null,"E7A_EC_FORMAT3F","Compléter une suite numérique croissante de pas égal à 10",null,"","7ans","auto-questionnaire ecole","questionnaire enfant","","","","","","exercices de dénombrement",null,""]
[null,null,null,"Compléter une suite numérique croissante de pas égal à 5","SUITE25","A06X_SUITE25",null,null,"donnée",null,null,"E7A_EC_FORMAT4F","Compléter une suite numérique croissante de pas égal à 5",null,"","7ans","auto-questionnaire ecole","questionnaire enfant","","","","","","exercices de dénombrement",null,""]
[null,null,null,"Compléter une suite numérique croissante de pas égal à 1","SUITE70","A06X_SUITE70",null,null,"donnée",null,null,"E7A_EC_FORMAT5F","Compléter une suite numérique croissante de pas égal à 1",null,"","7ans","auto-questionnaire ecole","questionnaire enfant","","","","","","exercices de dénombrement",null,""]
[null,null,null,"Compléter une suite numérique décroissante de pas égal à 2","SUITE6","A06X_SUITE6",null,null,"donnée",null,null,"E7A_EC_FORMAT6F","Compléter une suite numérique décroissante de pas égal à 2",null,"","7ans","auto-questionnaire ecole","questionnaire enfant","","","","","","exercices de dénombrement",null,""]
[null,null,null,"Compléter une suite numérique croissante de pas égal à 1","SUITE54","A06X_SUITE54",null,null,"donnée",null,null,"E7A_EC_FORMAT7F","Compléter une suite numérique croissante de pas égal à 1",null,"","7ans","auto-questionnaire ecole","questionnaire enfant","","","","","","exercices de dénombrement",null,""]
[null,null,null,"Comparer 23 et 32","COMPAR1","A06X_COMPAR1",null,null,"donnée",null,null,"E7A_EC_FORMAT8F","Comparer 23 et 32",null,"","7ans","auto-questionnaire ecole","questionnaire enfant","","","","","","exercices de dénombrement",null,""]
[null,null,null,"Comparer 54 et 45","COMPAR2","A06X_COMPAR2",null,null,"donnée",null,null,"E7A_EC_FORMAT8F","Comparer 54 et 45",null,"","7ans","auto-questionnaire ecole","questionnaire enfant","","","","","","exercices de dénombrement",null,""]
[null,null,null,"Comparer 50 et 50","COMPAR3","A06X_COMPAR3",null,null,"donnée",null,null,"E7A_EC_FORMAT8F","Comparer 50 et 50",null,"","7ans","auto-questionnaire ecole","questionnaire enfant","","","","","","exercices de dénombrement",null,""]
[null,null,null,"Comparer 29 et 61","COMPAR4","A06X_COMPAR4",null,null,"donnée",null,null,"E7A_EC_FORMAT8F","Comparer 29 et 61",null,"","7ans","auto-questionnaire ecole","questionnaire enfant","","","","","","exercices de dénombrement",null,""]
[null,null,null,"Comparer 68 et 70","COMPAR5","A06X_COMPAR5",null,null,"donnée",null,null,"E7A_EC_FORMAT8F","Comparer 68 et 70",null,"","7ans","auto-questionnaire ecole","questionnaire enfant","","","","","","exercices de dénombrement",null,""]
[null,null,null,"Comparer 51 et 49","COMPAR6","A06X_COMPAR6",null,null,"donnée",null,null,"E7A_EC_FORMAT8F","Comparer 51 et 49",null,"","7ans","auto-questionnaire ecole","questionnaire enfant","","","","","","exercices de dénombrement",null,""]
[null,null,null,"Comparer 70 et 58","COMPAR7","A06X_COMPAR7",null,null,"donnée",null,null,"E7A_EC_FORMAT8F","Comparer 70 et 58",null,"","7ans","auto-questionnaire ecole","questionnaire enfant","","","","","","exercices de dénombrement",null,""]
[null,null,null,"Comparer 69 et 100","COMPAR8","A06X_COMPAR8",null,null,"donnée",null,null,"E7A_EC_FORMAT8F","Comparer 69 et 100",null,"","7ans","auto-questionnaire ecole","questionnaire enfant","","","","","","exercices de dénombrement",0,""]
[null,null,null,"EXERCICES DE PHONOLOGIE",null,null,null,null,null,null,null,null,null,null,null,null,null,null,null,null,null,null,null,null,1]
[null,null,null,"Nombre de phonèmes dans vic","VIC","A06X_VIC",null,null,"donnée",null,null,"E7A_EC_FORMAT9F","Nombre de phonèmes dans vic",null,"","7ans","auto-questionnaire ecole","questionnaire enfant","","","","","","exercices de phonologie",null,""]
[null,null,null,"Nombre de phonèmes dans bivu","BIVU","A06X_BIVU",null,null,"donnée",null,null,"E7A_EC_FORMAT10F","Nombre de phonèmes dans bivu",null,"","7ans","auto-questionnaire ecole","questionnaire enfant","","","","","","exercices de phonologie",null,""]
[null,null,null,"Nombre de phonèmes dans fro","FRO","A06X_FRO",null,null,"donnée",null,null,"E7A_EC_FORMAT9F","Nombre de phonèmes dans fro",null,"","7ans","auto-questionnaire ecole","questionnaire enfant","","","","","","exercices de phonologie",null,""]
[null,null,null,"Nombre de phonèmes dans daf","DAF","A06X_DAF",null,null,"donnée",null,null,"E7A_EC_FORMAT9F","Nombre de phonèmes dans daf",null,"","7ans","auto-questionnaire ecole","questionnaire enfant","","","","","","exercices de phonologie",null,""]
[null,null,null,"Nombre de phonèmes dans utro","UTRO","A06X_UTRO",null,null,"donnée",null,null,"E7A_EC_FORMAT10F","Nombre de phonèmes dans utro",null,"","7ans","auto-questionnaire ecole","questionnaire enfant","","","","","","exercices de phonologie",null,""]
[null,null,null,"Nombre de phonèmes dans clu","CLU","A06X_CLU",null,null,"donnée",null,null,"E7A_EC_FORMAT9F","Nombre de phonèmes dans clu",null,"","7ans","auto-questionnaire ecole","questionnaire enfant","","","","","","exercices de phonologie",null,""]
[null,null,null,"Nombre de phonèmes dans plar","PLAR","A06X_PLAR",null,null,"donnée",null,null,"E7A_EC_FORMAT10F","Nombre de phonèmes dans plar",null,"","7ans","auto-questionnaire ecole","questionnaire enfant","","","","","","exercices de phonologie",null,""]
[null,null,null,"Nombre de phonèmes dans chi","CHI","A06X_CHI",null,null,"donnée",null,null,"E7A_EC_FORMAT11F","Nombre de phonèmes dans chi",null,"","7ans","auto-questionnaire ecole","questionnaire enfant","","","","","","exercices de phonologie",null,""]
[null,null,null,"Nombre de phonèmes dans acir","ACIR","A06X_ACIR",null,null,"donnée",null,null,"E7A_EC_FORMAT10F","Nombre de phonèmes dans acir",null,"","7ans","auto-questionnaire ecole","questionnaire enfant","","","","","","exercices de phonologie",null,""]
[null,null,null,"Nombre de phonèmes dans mou","MOU","A06X_MOU",null,null,"donnée",null,null,"E7A_EC_FORMAT11F","Nombre de phonèmes dans mou",null,"","7ans","auto-questionnaire ecole","questionnaire enfant","","","","","","exercices de phonologie",0,""]
[null,null,null,"EXERCICES DE COMPRÉHENSION",null,null,null,null,null,null,null,null,null,null,null,null,null,null,null,null,null,null,null,null,1]
[null,null,null,"Pourquoi zouzou est-il tout vert ?","PEINTURE","A06X_PEINTURE",null,null,"donnée",null,null,"E7A_EC_FORMAT8F","Pourquoi zouzou est-il tout vert ?",null,"","7ans","auto-questionnaire ecole","questionnaire enfant","","","","","","exercices de compréhension",null,""]
[null,null,null,"Pourquoi zouzou appelle-t-il sa maman ?","MANGER","A06X_MANGER",null,null,"donnée",null,null,"E7A_EC_FORMAT8F","Pourquoi zouzou appelle-t-il sa maman ?",null,"","7ans","auto-questionnaire ecole","questionnaire enfant","","","","","","exercices de compréhension",null,""]
[null,null,null,"Qui s'est sali ?","ZOUZOU","A06X_ZOUZOU",null,null,"donnée",null,null,"E7A_EC_FORMAT8F","Qui s'est sali ?",null,"","7ans","auto-questionnaire ecole","questionnaire enfant","","","","","","exercices de compréhension",null,""]
[null,null,null,"Pourquoi zouzou se roule-t-il dans l'herbe ?","LAVER","A06X_LAVER",null,null,"donnée",null,null,"E7A_EC_FORMAT8F","Pourquoi zouzou se roule-t-il dans l'herbe ?",null,"","7ans","auto-questionnaire ecole","questionnaire enfant","","","","","","exercices de compréhension",null,""]
[null,null,null,"Où habite la maison de zouzou ?","TERRIER","A06X_TERRIER",null,null,"donnée",null,null,"E7A_EC_FORMAT8F","Où habite la maison de zouzou ?",null,"","7ans","auto-questionnaire ecole","questionnaire enfant","","","","","","exercices de compréhension",null,""]
[null,null,null,"Qu'aime faire zouzou ?","DESSINER","A06X_DESSINER",null,null,"donnée",null,null,"E7A_EC_FORMAT8F","Qu'aime faire zouzou ?",null,"","7ans","auto-questionnaire ecole","questionnaire enfant","","","","","","exercices de compréhension",null,""]
[null,null,null,"Pourquoi le renard s'enfuit-il ?","MALADE","A06X_MALADE",null,null,"donnée",null,null,"E7A_EC_FORMAT8F","Pourquoi le renard s'enfuit-il ?",null,"","7ans","auto-questionnaire ecole","questionnaire enfant","","","","","","exercices de compréhension",null,""]
[null,null,null,"Qui explique au renard que zouzou est malade ?","MAMAN","A06X_MAMAN",null,null,"donnée",null,null,"E7A_EC_FORMAT8F","Qui explique au renard que zouzou est malade ?",null,"","7ans","auto-questionnaire ecole","questionnaire enfant","","","","","","exercices de compréhension",null,""]
[null,null,null,"Où se lave zouzou ?","HERBE","A06X_HERBE",null,null,"donnée",null,null,"E7A_EC_FORMAT8F","Où se lave zouzou ?",null,"","7ans","auto-questionnaire ecole","questionnaire enfant","","","","","","exercices de compréhension",null,""]
[null,null,null,"Comment était l'herbe sous les pattes de tommy ?","FRAICHE","A06X_FRAICHE",null,null,"donnée",null,null,"E7A_EC_FORMAT8F","Comment était l'herbe sous les pattes de tommy ?",null,"","7ans","auto-questionnaire ecole","questionnaire enfant","","","","","","exercices de compréhension",null,""]
[null,null,null,"Pourquoi est-ce que tommy bondissait ?","PAPILLON","A06X_PAPILLON",null,null,"donnée",null,null,"E7A_EC_FORMAT8F","Pourquoi est-ce que tommy bondissait ?",null,"","7ans","auto-questionnaire ecole","questionnaire enfant","","","","","","exercices de compréhension",null,""]
[null,null,null,"Où était le ballon ?","MAISON","A06X_MAISON",null,null,"donnée",null,null,"E7A_EC_FORMAT8F","Où était le ballon ?",null,"","7ans","auto-questionnaire ecole","questionnaire enfant","","","","","","exercices de compréhension",null,""]
[null,null,null,"Quelle est la couleur des poils du félin ?","NOIR","A06X_NOIR",null,null,"donnée",null,null,"E7A_EC_FORMAT8F","Quelle est la couleur des poils du félin ?",null,"","7ans","auto-questionnaire ecole","questionnaire enfant","","","","","","exercices de compréhension",null,""]
[null,null,null,"Qui est tommy ?","CHIEN","A06X_CHIEN",null,null,"donnée",null,null,"E7A_EC_FORMAT8F","Qui est tommy ?",null,"","7ans","auto-questionnaire ecole","questionnaire enfant","","","","","","exercices de compréhension",null,""]
[null,null,null,"Que font les papillons ?","VOLER","A06X_VOLER",null,null,"donnée",null,null,"E7A_EC_FORMAT8F","Que font les papillons ?",null,"","7ans","auto-questionnaire ecole","questionnaire enfant","","","","","","exercices de compréhension",null,""]
[null,null,null,"Qui surgit soudain sur le muret ?","MURET","A06X_MURET",null,null,"donnée",null,null,"E7A_EC_FORMAT8F","Qui surgit soudain sur le muret ?",null,"","7ans","auto-questionnaire ecole","questionnaire enfant","","","","","","exercices de compréhension",null,""]
[null,null,null,"Qui jette le ballon ?","QUENTIN","A06X_QUENTIN",null,null,"donnée",null,null,"E7A_EC_FORMAT8F","Qui jette le ballon ?",null,"","7ans","auto-questionnaire ecole","questionnaire enfant","","","","","","exercices de compréhension",null,""]
[null,null,null,"Qui fait le dos rond ?","ENNEMI","A06X_ENNEMI",null,null,"donnée",null,null,"E7A_EC_FORMAT8F","Qui fait le dos rond ?",null,"","7ans","auto-questionnaire ecole","questionnaire enfant","","","","","","exercices de compréhension",null,""]
[null,null,null,"Qu'est-ce que tommy va chercher ?","BALLON","A06X_BALLON",null,null,"donnée",null,null,"E7A_EC_FORMAT8F","Qu'est-ce que tommy va chercher ?",null,"","7ans","auto-questionnaire ecole","questionnaire enfant","","","","","","exercices de compréhension",null,""]
[null,null,null,"Où se passe l'histoire ?","JARDIN","A06X_JARDIN",null,null,"donnée",null,null,"E7A_EC_FORMAT8F","Où se passe l'histoire ?",null,"","7ans","auto-questionnaire ecole","questionnaire enfant","","","","","","exercices de compréhension",null,""]
[null,null,null,"Qui est quentin ?","GARCON","A06X_GARCON",null,null,"donnée",null,null,"E7A_EC_FORMAT8F","Qui est quentin ?",null,"","7ans","auto-questionnaire ecole","questionnaire enfant","","","","","","exercices de compréhension",0,""]
[null,null,null,"EXERCICES DE LECTURE",null,null,null,null,null,null,null,null,null,null,null,null,null,null,null,null,null,null,null,null,1]
[null,null,null,"Lecture du mot \"lit\"","LIT","A06X_LIT",null,null,"donnée","num",null,"E7A_EC_FORMAT12F","Lecture du mot \"lit\"",null,"","7ans","auto-questionnaire ecole","questionnaire enfant","","","","","","exercices de lecture",null,""]
[null,null,null,"Lecture du mot \"raisin\"","RAISIN","A06X_RAISIN",null,null,"donnée","num",null,"E7A_EC_FORMAT12F","Lecture du mot \"raisin\"",null,"","7ans","auto-questionnaire ecole","questionnaire enfant","","","","","","exercices de lecture"]
[null,null,null,"Lecture du mot \"cochon\"","COCHON","A06X_COCHON",null,null,"donnée","num",null,"E7A_EC_FORMAT12F","Lecture du mot \"cochon\"",null,"","7ans","auto-questionnaire ecole","questionnaire enfant","","","","","","exercices de lecture"]
[null,null,null,"Lecture du mot \"nid\"","NID","A06X_NID",null,null,"donnée","num",null,"E7A_EC_FORMAT12F","Lecture du mot \"nid\"",null,"","7ans","auto-questionnaire ecole","questionnaire enfant","","","","","","exercices de lecture"]
[null,null,null,"Lecture du mot \"table\"","TABLE","A06X_TABLE",null,null,"donnée","num",null,"E7A_EC_FORMAT12F","Lecture du mot \"table\"",null,"","7ans","auto-questionnaire ecole","questionnaire enfant","","","","","","exercices de lecture"]
[null,null,null,"Lecture du mot \"mouton\"","MOUTON","A06X_MOUTON",null,null,"donnée","num",null,"E7A_EC_FORMAT12F","Lecture du mot \"mouton\"",null,"","7ans","auto-questionnaire ecole","questionnaire enfant","","","","","","exercices de lecture"]
[null,null,null,"Lecture du mot \"fromage\"","FROMAGE","A06X_FROMAGE",null,null,"donnée","num",null,"E7A_EC_FORMAT12F","Lecture du mot \"fromage\"",null,"","7ans","auto-questionnaire ecole","questionnaire enfant","","","","","","exercices de lecture"]
[null,null,null,"Lecture du mot \"voiture\"","VOITURE","A06X_VOITURE",null,null,"donnée","num",null,"E7A_EC_FORMAT12F","Lecture du mot \"voiture\"",null,"","7ans","auto-questionnaire ecole","questionnaire enfant","","","","","","exercices de lecture"]
[null,null,null,"Lecture du mot \"cigogne\"","CIGOGNE","A06X_CIGOGNE",null,null,"donnée","num",null,"E7A_EC_FORMAT12F","Lecture du mot \"cigogne\"",null,"","7ans","auto-questionnaire ecole","questionnaire enfant","","","","","","exercices de lecture"]
[null,null,null,"Lecture du mot \"bouquet\"","BOUQUET","A06X_BOUQUET",null,null,"donnée","num",null,"E7A_EC_FORMAT12F","Lecture du mot \"bouquet\"",null,"","7ans","auto-questionnaire ecole","questionnaire enfant","","","","","","exercices de lecture"]
[null,null,null,"Lecture du mot \"guitare\"","GUITARE","A06X_GUITARE",null,null,"donnée","num",null,"E7A_EC_FORMAT12F","Lecture du mot \"guitare\"",null,"","7ans","auto-questionnaire ecole","questionnaire enfant","","","","","","exercices de lecture"]
[null,null,null,"Lecture du mot \"fleche\"","FLECHE","A06X_FLECHE",null,null,"donnée","num",null,"E7A_EC_FORMAT12F","Lecture du mot \"fleche\"",null,"","7ans","auto-questionnaire ecole","questionnaire enfant","","","","","","exercices de lecture"]
[null,null,null,"Lecture du mot \"fontaine\"","FONTAINE","A06X_FONTAINE",null,null,"donnée","num",null,"E7A_EC_FORMAT12F","Lecture du mot \"fontaine\"",null,"","7ans","auto-questionnaire ecole","questionnaire enfant","","","","","","exercices de lecture"]
[null,null,null,"Lecture du mot \"cadeau\"","CADEAU","A06X_CADEAU",null,null,"donnée","num",null,"E7A_EC_FORMAT12F","Lecture du mot \"cadeau\"",null,"","7ans","auto-questionnaire ecole","questionnaire enfant","","","","","","exercices de lecture"]
[null,null,null,"Réponse correcte ou incorrecte à la lecture du mot lit","LIT_REPONSE","A06X_LIT_REPONSE",null,null,"donnée","num",null,"E7A_EC_LECTURE_REPONSE","Réponse correcte ou incorrecte à la lecture du mot",null,null,null,null,null,null,null,null,null,null,"exercices de lecture"]
[null,null,null,"Réponse correcte ou incorrecte à la lecture du mot raisin","RAISIN_REPONSE","A06X_RAISIN_REPONSE",null,null,"donnée","num",null,"E7A_EC_LECTURE_REPONSE","Réponse correcte ou incorrecte à la lecture du mot",null,null,null,null,null,null,null,null,null,null,"exercices de lecture",null,""]
[null,null,null,"Réponse correcte ou incorrecte à la lecture du mot cochon","COCHON_REPONSE","A06X_COCHON_REPONSE",null,null,"donnée","num",null,"E7A_EC_LECTURE_REPONSE","Réponse correcte ou incorrecte à la lecture du mot",null,null,null,null,null,null,null,null,null,null,"exercices de lecture",null,""]
[null,null,null,"Réponse correcte ou incorrecte à la lecture du mot nid","NID_REPONSE","A06X_NID_REPONSE",null,null,"donnée","num",null,"E7A_EC_LECTURE_REPONSE","Réponse correcte ou incorrecte à la lecture du mot",null,null,null,null,null,null,null,null,null,null,"exercices de lecture",null,""]
[null,null,null,"Réponse correcte ou incorrecte à la lecture du mot table","TABLE_REPONSE","A06X_TABLE_REPONSE",null,null,"donnée","num",null,"E7A_EC_LECTURE_REPONSE","Réponse correcte ou incorrecte à la lecture du mot",null,null,null,null,null,null,null,null,null,null,"exercices de lecture",null,""]
[null,null,null,"Réponse correcte ou incorrecte à la lecture du mot mouton","MOUTON_REPONSE","A06X_MOUTON_REPONSE",null,null,"donnée","num",null,"E7A_EC_LECTURE_REPONSE","Réponse correcte ou incorrecte à la lecture du mot",null,null,null,null,null,null,null,null,null,null,"exercices de lecture",null,""]
[null,null,null,"Réponse correcte ou incorrecte à la lecture du mot fromage","FROMAGE_REPONSE","A06X_FROMAGE_REPONSE",null,null,"donnée","num",null,"E7A_EC_LECTURE_REPONSE","Réponse correcte ou incorrecte à la lecture du mot",null,null,null,null,null,null,null,null,null,null,"exercices de lecture",null,""]
[null,null,null,"Réponse correcte ou incorrecte à la lecture du mot voiture","VOITURE_REPONSE","A06X_VOITURE_REPONSE",null,null,"donnée","num",null,"E7A_EC_LECTURE_REPONSE","Réponse correcte ou incorrecte à la lecture du mot",null,null,null,null,null,null,null,null,null,null,"exercices de lecture",null,""]
[null,null,null,"Réponse correcte ou incorrecte à la lecture du mot cigogne","CIGOGNE_REPONSE","A06X_CIGOGNE_REPONSE",null,null,"donnée","num",null,"E7A_EC_LECTURE_REPONSE","Réponse correcte ou incorrecte à la lecture du mot",null,null,null,null,null,null,null,null,null,null,"exercices de lecture",null,""]
[null,null,null,"Réponse correcte ou incorrecte à la lecture du mot bouquet","BOUQUET_REPONSE","A06X_BOUQUET_REPONSE",null,null,"donnée","num",null,"E7A_EC_LECTURE_REPONSE","Réponse correcte ou incorrecte à la lecture du mot",null,null,null,null,null,null,null,null,null,null,"exercices de lecture",null,""]
[null,null,null,"Réponse correcte ou incorrecte à la lecture du mot guitare","GUITARE_REPONSE","A06X_GUITARE_REPONSE",null,null,"donnée","num",null,"E7A_EC_LECTURE_REPONSE","Réponse correcte ou incorrecte à la lecture du mot",null,null,null,null,null,null,null,null,null,null,"exercices de lecture",null,""]
[null,null,null,"Réponse correcte ou incorrecte à la lecture du mot fleche","FLECHE_REPONSE","A06X_FLECHE_REPONSE",null,null,"donnée","num",null,"E7A_EC_LECTURE_REPONSE","Réponse correcte ou incorrecte à la lecture du mot",null,null,null,null,null,null,null,null,null,null,"exercices de lecture",null,""]
[null,null,null,"Réponse correcte ou incorrecte à la lecture du mot fontaine","FONTAINE_REPONSE","A06X_FONTAINE_REPONSE",null,null,"donnée","num",null,"E7A_EC_LECTURE_REPONSE","Réponse correcte ou incorrecte à la lecture du mot",null,null,null,null,null,null,null,null,null,null,"exercices de lecture",null,""]
[null,null,null,"Réponse correcte ou incorrecte à la lecture du mot cadeau","CADEAU_REPONSE","A06X_CADEAU_REPONSE",null,null,"donnée","num",null,"E7A_EC_LECTURE_REPONSE","Réponse correcte ou incorrecte à la lecture du mot",null,null,null,null,null,null,null,null,null,null,"exercices de lecture",null,""]
[null,null,null,"Nombre total de réponses correctes","LECTURE_TOTAL_CORRECT","A06X_LECTURE_TOTAL_CORRECT",null,null,"donnée","num",null,null,"Nombre total de réponses correctes",null,null,null,null,null,null,null,null,null,null,"exercices de lecture",0]
[null,null,null,"MESURE DE L'ESTIME DE SOI",null,null,null,null,null,null,null,null,null,null,null,null,null,null,null,null,null,null,null,null,1]
[null,null,null,"Je travaille bien à l'école","TRAVAILLER","A06X_TRAVAILLER",null,null,"donnée",null,null,"E7A_EC_FORMAT13F","Je travaille bien à l'école",null,"","7ans","auto-questionnaire ecole","questionnaire enfant","Développement","","","","","mesure de l'estime de soi",null,""]
[null,null,null,"Lorsque la maîtresse (le maître) s'absente, je fais du bruit","BRUIT","A06X_BRUIT",null,null,"donnée",null,null,"E7A_EC_FORMAT13F","Lorsque la maîtresse (le maître) s'absente, je fais du bruit",null,"","7ans","auto-questionnaire ecole","questionnaire enfant","Développement","","","","","mesure de l'estime de soi",null,""]
[null,null,null,"Je suis content de ma vie","MAVIE","A06X_MAVIE",null,null,"donnée",null,null,"E7A_EC_FORMAT13F","Je suis content de ma vie",null,"","7ans","auto-questionnaire ecole","questionnaire enfant","Développement","","","","","mesure de l'estime de soi",null,""]
[null,null,null,"Les adultes doivent se fâcher pour que j'obéisse","OBEIR","A06X_OBEIR",null,null,"donnée",null,null,"E7A_EC_FORMAT13F","Les adultes doivent se fâcher pour que j'obéisse",null,"","7ans","auto-questionnaire ecole","questionnaire enfant","Développement","","","","","mesure de l'estime de soi",null,""]
[null,null,null,"Je suis content de moi","CONTENT","A06X_CONTENT",null,null,"donnée",null,null,"E7A_EC_FORMAT13F","Je suis content de moi",null,"","7ans","auto-questionnaire ecole","questionnaire enfant","Développement","","","","","mesure de l'estime de soi",null,""]
[null,null,null,"Je me rappelle facilement ce que j'apprends à l'école","MEMORISER","A06X_MEMORISER",null,null,"donnée",null,null,"E7A_EC_FORMAT13F","Je me rappelle facilement ce que j'apprends à l'école",null,"","7ans","auto-questionnaire ecole","questionnaire enfant","Développement","","","","","mesure de l'estime de soi",null,""]
[null,null,null,"Je sais faire rire mes copains","RIRE","A06X_RIRE",null,null,"donnée",null,null,"E7A_EC_FORMAT13F","Je sais faire rire mes copains",null,"","7ans","auto-questionnaire ecole","questionnaire enfant","Développement","","","","","mesure de l'estime de soi",null,""]
[null,null,null,"En classe, j'y arrive aussi bien que les autres élèves","REUSSIR","A06X_REUSSIR",null,null,"donnée",null,null,"E7A_EC_FORMAT13F","En classe, j'y arrive aussi bien que les autres élèves",null,"","7ans","auto-questionnaire ecole","questionnaire enfant","Développement","","","","","mesure de l'estime de soi",null,""]
[null,null,null,"Je suis aimé par les élèves de ma classe","POPULAIRE","A06X_POPULAIRE",null,null,"donnée",null,null,"E7A_EC_FORMAT13F","Je suis aimé par les élèves de ma classe",null,"","7ans","auto-questionnaire ecole","questionnaire enfant","Développement","","","","","mesure de l'estime de soi",null,""]
[null,null,null,"Je n'écoute pas les conseils des adultes","ECOUTER","A06X_ECOUTER",null,null,"donnée",null,null,"E7A_EC_FORMAT13F","Je n'écoute pas les conseils des adultes",null,"","7ans","auto-questionnaire ecole","questionnaire enfant","Développement","","","","","mesure de l'estime de soi",null,""]
[null,null,null,"En classe, je trouve le réponses aux questions","TROUVER","A06X_TROUVER",null,null,"donnée",null,null,"E7A_EC_FORMAT13F","En classe, je trouve le réponses aux questions",null,"","7ans","auto-questionnaire ecole","questionnaire enfant","Développement","","","","","mesure de l'estime de soi",null,""]
[null,null,null,"C 'est souvent moi qui décide d'un jeu","DECIDER","A06X_DECIDER",null,null,"donnée",null,null,"E7A_EC_FORMAT13F","C 'est souvent moi qui décide d'un jeu",null,"","7ans","auto-questionnaire ecole","questionnaire enfant","Développement","","","","","mesure de l'estime de soi",null,""]
[null,null,null,"Je suis agréable avec les autres enfants","AGREABLE","A06X_AGREABLE",null,null,"donnée",null,null,"E7A_EC_FORMAT13F","Je suis agréable avec les autres enfants",null,"","7ans","auto-questionnaire ecole","questionnaire enfant","Développement","","","","","mesure de l'estime de soi",0,""]
[null,null,null,"QUESTIONNAIRE ENSEIGNANT",null,null,null,null,null,null,null,null,null,null,null,null,null,null,null,null,null,null,null,null,1]
[null,null,null,"A quel niveau est scolarisé l'enfant elfe ?","SCOL","A06X_SCOL",null,null,"donnée",null,null,"E7A_EC_FORMAT14S","A quel niveau est scolarisé l'enfant elfe ?",null,"","7ans","auto-questionnaire ecole","questionnaire enseignant","","","","","",null,null,""]
[null,null,null,"A quel niveau est scolarisé l'enfant elfe ? préciser","SCOLP","A06X_SCOLP",null,null,"non-disponible",null,null,"","A quel niveau est scolarisé l'enfant elfe ? préciser",null,"","7ans","auto-questionnaire ecole","questionnaire enseignant","","","","","",null,null,""]
[null,null,null,"Selon votre expérience professionnelle, comment évaluez-vous les compétences de l’enfant par rapport aux enfants de son âge (et pas seulement les enfants de votre classe ou de l’école)","FRANCAIS","A06X_FRANCAIS",null,null,"donnée",null,null,"E7A_EC_FORMAT15S","Selon votre expérience professionnelle, comment évaluez-vous les compétences de l’enfant par rapport aux enfants de son âge (et pas seulement les enfants de votre classe ou de l’école)",null,"","7ans","auto-questionnaire ecole","questionnaire enseignant","","","","","",null,null,""]
[null,null,null,"Selon votre expérience professionnelle, comment évaluez-vous les compétences de l’enfant par rapport aux enfants de son âge (et pas seulement les enfants de votre classe ou de l’école)","MATHEMATIQUES","A06X_MATHEMATIQUES",null,null,"donnée",null,null,"E7A_EC_FORMAT15S","Selon votre expérience professionnelle, comment évaluez-vous les compétences de l’enfant par rapport aux enfants de son âge (et pas seulement les enfants de votre classe ou de l’école)",null,"","7ans","auto-questionnaire ecole","questionnaire enseignant","","","","","",null,null,""]
[null,null,null,"Selon votre expérience professionnelle, comment évaluez-vous les compétences de l’enfant par rapport aux enfants de son âge (et pas seulement les enfants de votre classe ou de l’école)","ACTIPHYS","A06X_ACTIPHYS",null,null,"donnée",null,null,"E7A_EC_FORMAT15S","Selon votre expérience professionnelle, comment évaluez-vous les compétences de l’enfant par rapport aux enfants de son âge (et pas seulement les enfants de votre classe ou de l’école)",null,"","7ans","auto-questionnaire ecole","questionnaire enseignant","","","","","",null,null,""]
[null,null,null,"Selon votre expérience professionnelle, comment évaluez-vous les compétences de l’enfant par rapport aux enfants de son âge (et pas seulement les enfants de votre classe ou de l’école)","LANGVIV","A06X_LANGVIV",null,null,"donnée",null,null,"E7A_EC_FORMAT15S","Selon votre expérience professionnelle, comment évaluez-vous les compétences de l’enfant par rapport aux enfants de son âge (et pas seulement les enfants de votre classe ou de l’école)",null,"","7ans","auto-questionnaire ecole","questionnaire enseignant","","","","","",null,null,""]
[null,null,null,"Selon votre expérience professionnelle, comment évaluez-vous les compétences de l’enfant par rapport aux enfants de son âge (et pas seulement les enfants de votre classe ou de l’école)","ACTIARTIS","A06X_ACTIARTIS",null,null,"donnée",null,null,"E7A_EC_FORMAT15S","Selon votre expérience professionnelle, comment évaluez-vous les compétences de l’enfant par rapport aux enfants de son âge (et pas seulement les enfants de votre classe ou de l’école)",null,"","7ans","auto-questionnaire ecole","questionnaire enseignant","","","","","",null,null,""]
[null,null,null,"Selon votre expérience professionnelle, comment évaluez-vous les compétences de l’enfant par rapport aux enfants de son âge (et pas seulement les enfants de votre classe ou de l’école)","QUESTMONDE","A06X_QUESTMONDE",null,null,"donnée",null,null,"E7A_EC_FORMAT15S","Selon votre expérience professionnelle, comment évaluez-vous les compétences de l’enfant par rapport aux enfants de son âge (et pas seulement les enfants de votre classe ou de l’école)",null,"","7ans","auto-questionnaire ecole","questionnaire enseignant","","","","","",null,null,""]
[null,null,null,"Selon votre expérience professionnelle, comment évaluez-vous les compétences de l’enfant par rapport aux enfants de son âge (et pas seulement les enfants de votre classe ou de l’école)","MORALCIVIC","A06X_MORALCIVIC",null,null,"donnée",null,null,"E7A_EC_FORMAT15S","Selon votre expérience professionnelle, comment évaluez-vous les compétences de l’enfant par rapport aux enfants de son âge (et pas seulement les enfants de votre classe ou de l’école)",null,"","7ans","auto-questionnaire ecole","questionnaire enseignant","","","","","",null,null,""]
[null,null,null,"En vous basant sur les six derniers mois et pour chacun des items ci-dessous, indiquer s’il s’applique au comportement de l’enfant","ATTENTA","A06X_ATTENTA",null,null,"donnée",null,null,"E7A_EC_FORMAT16S","En vous basant sur les six derniers mois et pour chacun des items ci-dessous, indiquer s’il s’applique au comportement de l’enfant",null,"","7ans","auto-questionnaire ecole","questionnaire enseignant","","","","","",null,null,""]
[null,null,null,"En vous basant sur les six derniers mois et pour chacun des items ci-dessous, indiquer s’il s’applique au comportement de l’enfant","PLAINT","A06X_PLAINT",null,null,"donnée",null,null,"E7A_EC_FORMAT16S","En vous basant sur les six derniers mois et pour chacun des items ci-dessous, indiquer s’il s’applique au comportement de l’enfant",null,"","7ans","auto-questionnaire ecole","questionnaire enseignant","","","","","",null,null,""]
[null,null,null,"En vous basant sur les six derniers mois et pour chacun des items ci-dessous, indiquer s’il s’applique au comportement de l’enfant","PARTAG","A06X_PARTAG",null,null,"donnée",null,null,"E7A_EC_FORMAT16S","En vous basant sur les six derniers mois et pour chacun des items ci-dessous, indiquer s’il s’applique au comportement de l’enfant",null,"","7ans","auto-questionnaire ecole","questionnaire enseignant","","","","","",null,null,""]
[null,null,null,"En vous basant sur les six derniers mois et pour chacun des items ci-dessous, indiquer s’il s’applique au comportement de l’enfant","OBEIS","A06X_OBEIS",null,null,"donnée",null,null,"E7A_EC_FORMAT16S","En vous basant sur les six derniers mois et pour chacun des items ci-dessous, indiquer s’il s’applique au comportement de l’enfant",null,"","7ans","auto-questionnaire ecole","questionnaire enseignant","","","","","",null,null,""]
[null,null,null,"En vous basant sur les six derniers mois et pour chacun des items ci-dessous, indiquer s’il s’applique au comportement de l’enfant","INQUIE","A06X_INQUIE",null,null,"donnée",null,null,"E7A_EC_FORMAT16S","En vous basant sur les six derniers mois et pour chacun des items ci-dessous, indiquer s’il s’applique au comportement de l’enfant",null,"","7ans","auto-questionnaire ecole","questionnaire enseignant","","","","","",null,null,""]
[null,null,null,"En vous basant sur les six derniers mois et pour chacun des items ci-dessous, indiquer s’il s’applique au comportement de l’enfant","NTIENTP","A06X_NTIENTP",null,null,"donnée",null,null,"E7A_EC_FORMAT16S","En vous basant sur les six derniers mois et pour chacun des items ci-dessous, indiquer s’il s’applique au comportement de l’enfant",null,"","7ans","auto-questionnaire ecole","questionnaire enseignant","","","","","",null,null,""]
[null,null,null,"En vous basant sur les six derniers mois et pour chacun des items ci-dessous, indiquer s’il s’applique au comportement de l’enfant","AAMI","A06X_AAMI",null,null,"donnée",null,null,"E7A_EC_FORMAT16S","En vous basant sur les six derniers mois et pour chacun des items ci-dessous, indiquer s’il s’applique au comportement de l’enfant",null,"","7ans","auto-questionnaire ecole","questionnaire enseignant","","","","","",null,null,""]
[null,null,null,"En vous basant sur les six derniers mois et pour chacun des items ci-dessous, indiquer s’il s’applique au comportement de l’enfant","DISTRA","A06X_DISTRA",null,null,"donnée",null,null,"E7A_EC_FORMAT16S","En vous basant sur les six derniers mois et pour chacun des items ci-dessous, indiquer s’il s’applique au comportement de l’enfant",null,"","7ans","auto-questionnaire ecole","questionnaire enseignant","","","","","",null,null,""]
[null,null,null,"En vous basant sur les six derniers mois et pour chacun des items ci-dessous, indiquer s’il s’applique au comportement de l’enfant","ANXIEU","A06X_ANXIEU",null,null,"donnée",null,null,"E7A_EC_FORMAT16S","En vous basant sur les six derniers mois et pour chacun des items ci-dessous, indiquer s’il s’applique au comportement de l’enfant",null,"","7ans","auto-questionnaire ecole","questionnaire enseignant","","","","","",null,null,""]
[null,null,null,"En vous basant sur les six derniers mois et pour chacun des items ci-dessous, indiquer s’il s’applique au comportement de l’enfant","AIDE","A06X_AIDE",null,null,"donnée",null,null,"E7A_EC_FORMAT16S","En vous basant sur les six derniers mois et pour chacun des items ci-dessous, indiquer s’il s’applique au comportement de l’enfant",null,"","7ans","auto-questionnaire ecole","questionnaire enseignant","","","","","",null,null,""]
[null,null,null,"En vous basant sur les six derniers mois et pour chacun des items ci-dessous, indiquer s’il s’applique au comportement de l’enfant","REFLECHI","A06X_REFLECHI",null,null,"donnée",null,null,"E7A_EC_FORMAT16S","En vous basant sur les six derniers mois et pour chacun des items ci-dessous, indiquer s’il s’applique au comportement de l’enfant",null,"","7ans","auto-questionnaire ecole","questionnaire enseignant","","","","","",null,null,""]
[null,null,null,"En vous basant sur les six derniers mois et pour chacun des items ci-dessous, indiquer s’il s’applique au comportement de l’enfant","ATTENTI","A06X_ATTENTI",null,null,"donnée",null,null,"E7A_EC_FORMAT16S","En vous basant sur les six derniers mois et pour chacun des items ci-dessous, indiquer s’il s’applique au comportement de l’enfant",null,"","7ans","auto-questionnaire ecole","questionnaire enseignant","","","","","",null,null,""]
[null,null,null,"Un ou plusieurs troubles concernent-ils cet enfant ? difficultés d'apprentissage","TROUBLE1","A06X_TROUBLE1",null,null,"donnée",null,null,"E7A_EC_FORMAT17S","Un ou plusieurs troubles concernent-ils cet enfant ? difficultés d'apprentissage",null,"","7ans","auto-questionnaire ecole","questionnaire enseignant","Handicap","","","","",null,null,""]
[null,null,null,"Un ou plusieurs troubles concernent-ils cet enfant ? troubles de l'attention","TROUBLE2","A06X_TROUBLE2",null,null,"donnée",null,null,"E7A_EC_FORMAT17S","Un ou plusieurs troubles concernent-ils cet enfant ? troubles de l'attention",null,"","7ans","auto-questionnaire ecole","questionnaire enseignant","Handicap","","","","",null,null,""]
[null,null,null,"Un ou plusieurs troubles concernent-ils cet enfant ? autres difficultés (mémorisation…)","TROUBLE3","A06X_TROUBLE3",null,null,"donnée",null,null,"E7A_EC_FORMAT17S","Un ou plusieurs troubles concernent-ils cet enfant ? autres difficultés (mémorisation…)",null,"","7ans","auto-questionnaire ecole","questionnaire enseignant","Handicap","","","","",null,null,""]
[null,null,null,"Un ou plusieurs troubles concernent-ils cet enfant ? troubles du langage et de la parole","TROUBLE4","A06X_TROUBLE4",null,null,"donnée",null,null,"E7A_EC_FORMAT17S","Un ou plusieurs troubles concernent-ils cet enfant ? troubles du langage et de la parole",null,"","7ans","auto-questionnaire ecole","questionnaire enseignant","Handicap","","","","",null,null,""]
[null,null,null,"Un ou plusieurs troubles concernent-ils cet enfant ? problème ou déficit auditif","TROUBLE5","A06X_TROUBLE5",null,null,"donnée",null,null,"E7A_EC_FORMAT17S","Un ou plusieurs troubles concernent-ils cet enfant ? problème ou déficit auditif",null,"","7ans","auto-questionnaire ecole","questionnaire enseignant","Handicap","","","","",null,null,""]
[null,null,null,"Un ou plusieurs troubles concernent-ils cet enfant ? problème ou déficit visuel","TROUBLE6","A06X_TROUBLE6",null,null,"donnée",null,null,"E7A_EC_FORMAT17S","Un ou plusieurs troubles concernent-ils cet enfant ? problème ou déficit visuel",null,"","7ans","auto-questionnaire ecole","questionnaire enseignant","Handicap","","","","",null,null,""]
[null,null,null,"Un ou plusieurs troubles concernent-ils cet enfant ? autre handicap physique ou moteur","TROUBLE7","A06X_TROUBLE7",null,null,"donnée",null,null,"E7A_EC_FORMAT17S","Un ou plusieurs troubles concernent-ils cet enfant ? autre handicap physique ou moteur",null,"","7ans","auto-questionnaire ecole","questionnaire enseignant","Handicap","","","","",null,null,""]
[null,null,null,"Un ou plusieurs troubles concernent-ils cet enfant ? troubles importants de la fonction cognitive ou retard mental ou déficience intellectuelle","TROUBLE8","A06X_TROUBLE8",null,null,"donnée",null,null,"E7A_EC_FORMAT17S","Un ou plusieurs troubles concernent-ils cet enfant ? troubles importants de la fonction cognitive ou retard mental ou déficience intellectuelle",null,"","7ans","auto-questionnaire ecole","questionnaire enseignant","Handicap","","","","",null,null,""]
[null,null,null,"Un ou plusieurs troubles concernent-ils cet enfant ? troubles de type autistique","TROUBLE9","A06X_TROUBLE9",null,null,"donnée",null,null,"E7A_EC_FORMAT17S","Un ou plusieurs troubles concernent-ils cet enfant ? troubles de type autistique",null,"","7ans","auto-questionnaire ecole","questionnaire enseignant","Handicap","","","","",null,null,""]
[null,null,null,"Un ou plusieurs troubles concernent-ils cet enfant ? problèmes de comportement, hyperactivité","TROUBLE10","A06X_TROUBLE10",null,null,"donnée",null,null,"E7A_EC_FORMAT17S","Un ou plusieurs troubles concernent-ils cet enfant ? problèmes de comportement, hyperactivité",null,"","7ans","auto-questionnaire ecole","questionnaire enseignant","Handicap","","","","",null,null,""]
[null,null,null,"Un ou plusieurs troubles concernent-ils cet enfant ? troubles du psychisme (anxiété, dépression, inhibition…)","TROUBLE11","A06X_TROUBLE11",null,null,"donnée",null,null,"E7A_EC_FORMAT17S","Un ou plusieurs troubles concernent-ils cet enfant ? troubles du psychisme (anxiété, dépression, inhibition…)",null,"","7ans","auto-questionnaire ecole","questionnaire enseignant","Handicap","","","","",null,null,""]
[null,null,null,"Un ou plusieurs troubles concernent-ils cet enfant ? haut potentiel ou enfant précoce","TROUBLE12","A06X_TROUBLE12",null,null,"donnée",null,null,"E7A_EC_FORMAT17S","Un ou plusieurs troubles concernent-ils cet enfant ? haut potentiel ou enfant précoce",null,"","7ans","auto-questionnaire ecole","questionnaire enseignant","Handicap","","","","",null,null,""]
[null,null,null,"Un ou plusieurs troubles concernent-ils cet enfant ? autre. préciser","TROUBLE13","A06X_TROUBLE13",null,null,"donnée",null,null,"E7A_EC_FORMAT17S","Un ou plusieurs troubles concernent-ils cet enfant ? autre. préciser",null,"","7ans","auto-questionnaire ecole","questionnaire enseignant","Handicap","","","","",null,null,""]
[null,null,null,"Un ou plusieurs troubles concernent-ils cet enfant ? aucun des troubles précédents","TROUBLE14","A06X_TROUBLE14",null,null,"donnée",null,null,"E7A_EC_FORMAT17S","Un ou plusieurs troubles concernent-ils cet enfant ? aucun des troubles précédents",null,"","7ans","auto-questionnaire ecole","questionnaire enseignant","Handicap","","","","",null,null,""]
[null,null,null,"Un ou plusieurs troubles concernent-ils cet enfant ? préciser","TROUBLEP","A06X_TROUBLEP",null,null,"non-disponible",null,null,"","Un ou plusieurs troubles concernent-ils cet enfant ? préciser",null,"","7ans","auto-questionnaire ecole","questionnaire enseignant","Handicap","","","","",null,null,""]
[null,null,null,"Selon vous, l'une des difficultés rencontrées par l'enfant nécessite-t-il une prise en charge particulière ?","BESOIN","A06X_BESOIN",null,null,"donnée",null,null,"E7A_EC_FORMAT18S","Selon vous, l'une des difficultés rencontrées par l'enfant nécessite-t-il une prise en charge particulière ?",null,"","7ans","auto-questionnaire ecole","questionnaire enseignant","","","","","",null,null,""]
[null,null,null,"De quel type de prise en charge l'enfant bénéficie-t-il ? programme personnalisé de réussite éducative (ppre)","DISPOSITIF1","A06X_DISPOSITIF1",null,null,"donnée",null,null,"E7A_EC_FORMAT17S","De quel type de prise en charge l'enfant bénéficie-t-il ? programme personnalisé de réussite éducative (ppre)",null,"","7ans","auto-questionnaire ecole","questionnaire enseignant","","","","","",null,null,""]
[null,null,null,"De quel type de prise en charge l'enfant bénéficie-t-il ? soutien d'un membre du rased","DISPOSITIF2","A06X_DISPOSITIF2",null,null,"donnée",null,null,"E7A_EC_FORMAT17S","De quel type de prise en charge l'enfant bénéficie-t-il ? soutien d'un membre du rased",null,"","7ans","auto-questionnaire ecole","questionnaire enseignant","","","","","",null,null,""]
[null,null,null,"De quel type de prise en charge l'enfant bénéficie-t-il ? prise en charge spécifique dans le cadre scolaire","DISPOSITIF3","A06X_DISPOSITIF3",null,null,"donnée",null,null,"E7A_EC_FORMAT17S","De quel type de prise en charge l'enfant bénéficie-t-il ? prise en charge spécifique dans le cadre scolaire",null,"","7ans","auto-questionnaire ecole","questionnaire enseignant","","","","","",null,null,""]
[null,null,null,"De quel type de prise en charge l'enfant bénéficie-t-il ? aide humaine ou avs","DISPOSITIF4","A06X_DISPOSITIF4",null,null,"donnée",null,null,"E7A_EC_FORMAT17S","De quel type de prise en charge l'enfant bénéficie-t-il ? aide humaine ou avs",null,"","7ans","auto-questionnaire ecole","questionnaire enseignant","Handicap","","","","",null,null,""]
[null,null,null,"De quel type de prise en charge l'enfant bénéficie-t-il ? animateur, bénévole","DISPOSITIF5","A06X_DISPOSITIF5",null,null,"donnée",null,null,"E7A_EC_FORMAT17S","De quel type de prise en charge l'enfant bénéficie-t-il ? animateur, bénévole",null,"","7ans","auto-questionnaire ecole","questionnaire enseignant","","","","","",null,null,""]
[null,null,null,"De quel type de prise en charge l'enfant bénéficie-t-il ? enseignant","DISPOSITIF6","A06X_DISPOSITIF6",null,null,"donnée",null,null,"E7A_EC_FORMAT17S","De quel type de prise en charge l'enfant bénéficie-t-il ? enseignant",null,"","7ans","auto-questionnaire ecole","questionnaire enseignant","","","","","",null,null,""]
[null,null,null,"De quel type de prise en charge l'enfant bénéficie-t-il ? autre. préciser","DISPOSITIF7","A06X_DISPOSITIF7",null,null,"donnée",null,null,"E7A_EC_FORMAT17S","De quel type de prise en charge l'enfant bénéficie-t-il ? autre. préciser",null,"","7ans","auto-questionnaire ecole","questionnaire enseignant","","","","","",null,null,""]
[null,null,null,"De quel type de prise en charge l'enfant bénéficie-t-il ? projet d'accueil individualisé (pai)","DISPOSITIF8","A06X_DISPOSITIF8",null,null,"donnée",null,null,"E7A_EC_FORMAT17S","De quel type de prise en charge l'enfant bénéficie-t-il ? projet d'accueil individualisé (pai)",null,"","7ans","auto-questionnaire ecole","questionnaire enseignant","Handicap","","","","",null,null,""]
[null,null,null,"De quel type de prise en charge l'enfant bénéficie-t-il ? projet personnalisé de scolarisation (pps)","DISPOSITIF9","A06X_DISPOSITIF9",null,null,"donnée",null,null,"E7A_EC_FORMAT17S","De quel type de prise en charge l'enfant bénéficie-t-il ? projet personnalisé de scolarisation (pps)",null,"","7ans","auto-questionnaire ecole","questionnaire enseignant","Handicap","","","","",null,null,""]
[null,null,null,"De quel type de prise en charge l'enfant bénéficie-t-il ? autre dispositif impliquant des personnels extérieurs. préciser","DISPOSITIF10","A06X_DISPOSITIF10",null,null,"donnée",null,null,"E7A_EC_FORMAT17S","De quel type de prise en charge l'enfant bénéficie-t-il ? autre dispositif impliquant des personnels extérieurs. préciser",null,"","7ans","auto-questionnaire ecole","questionnaire enseignant","","","","","",null,null,""]
[null,null,null,"De quel type de prise en charge l'enfant bénéficie-t-il ? aucun des dispositifs précédents","DISPOSITIF11","A06X_DISPOSITIF11",null,null,"donnée",null,null,"E7A_EC_FORMAT17S","De quel type de prise en charge l'enfant bénéficie-t-il ? aucun des dispositifs précédents",null,"","7ans","auto-questionnaire ecole","questionnaire enseignant","","","","","",null,null,""]
[null,null,null,"De quel type de prise en charge l'enfant bénéficie-t-il ? préciser","DISPOSITIFP","A06X_DISPOSITIFP",null,null,"non-disponible",null,null,"","De quel type de prise en charge l'enfant bénéficie-t-il ? préciser",null,"","7ans","auto-questionnaire ecole","questionnaire enseignant","","","","","",null,null,""]
[null,null,null,"De quel type de prise en charge l'enfant bénéficie-t-il ? préciser","DISPOSITIFPP","A06X_DISPOSITIFPP",null,null,"non-disponible",null,null,"","De quel type de prise en charge l'enfant bénéficie-t-il ? préciser",null,"","7ans","auto-questionnaire ecole","questionnaire enseignant","","","","","",null,null,""]
[null,null,null,"Quels sont les jours d’école ?","RYTHME","A06X_RYTHME",null,null,"donnée",null,null,"E7A_EC_FORMAT19S","Quels sont les jours d’école ?",null,"","7ans","auto-questionnaire ecole","questionnaire enseignant","","","","","",null,null,""]
[null,null,null,"Quel est l’effectif de votre classe ?","NBELEVES","A06X_NBELEVES",null,null,"donnée",null,null,"","Quel est l’effectif de votre classe ?",null,"","7ans","auto-questionnaire ecole","questionnaire enseignant","","","","","",null,null,""]
[null,null,null,"S ’agit-il d’une classe simple ou à plusieurs niveaux ? (nsp ou plusieurs réponses cochées)","NIVECLASS0","A06X_NIVECLASS0",null,null,"donnée",null,null,"E7A_EC_FORMAT17S","S ’agit-il d’une classe simple ou à plusieurs niveaux ? (nsp ou plusieurs réponses cochées)",null,"","7ans","auto-questionnaire ecole","questionnaire enseignant","","","","","",null,null,""]
[null,null,null,"S ’agit-il d’une classe simple ou à plusieurs niveaux ? (gs)","NIVECLASS1","A06X_NIVECLASS1",null,null,"donnée",null,null,"E7A_EC_FORMAT17S","S ’agit-il d’une classe simple ou à plusieurs niveaux ? (gs)",null,"","7ans","auto-questionnaire ecole","questionnaire enseignant","","","","","",null,null,""]
[null,null,null,"S ’agit-il d’une classe simple ou à plusieurs niveaux ? (cp)","NIVECLASS2","A06X_NIVECLASS2",null,null,"donnée",null,null,"E7A_EC_FORMAT17S","S ’agit-il d’une classe simple ou à plusieurs niveaux ? (cp)",null,"","7ans","auto-questionnaire ecole","questionnaire enseignant","","","","","",null,null,""]
[null,null,null,"S ’agit-il d’une classe simple ou à plusieurs niveaux ? (ce1)","NIVECLASS3","A06X_NIVECLASS3",null,null,"donnée",null,null,"E7A_EC_FORMAT17S","S ’agit-il d’une classe simple ou à plusieurs niveaux ? (ce1)",null,"","7ans","auto-questionnaire ecole","questionnaire enseignant","","","","","",null,null,""]
[null,null,null,"S ’agit-il d’une classe simple ou à plusieurs niveaux ? (gs-cp)","NIVECLASS4","A06X_NIVECLASS4",null,null,"donnée",null,null,"E7A_EC_FORMAT17S","S ’agit-il d’une classe simple ou à plusieurs niveaux ? (gs-cp)",null,"","7ans","auto-questionnaire ecole","questionnaire enseignant","","","","","",null,null,""]
[null,null,null,"S ’agit-il d’une classe simple ou à plusieurs niveaux ? (cp-ce1)","NIVECLASS5","A06X_NIVECLASS5",null,null,"donnée",null,null,"E7A_EC_FORMAT17S","S ’agit-il d’une classe simple ou à plusieurs niveaux ? (cp-ce1)",null,"","7ans","auto-questionnaire ecole","questionnaire enseignant","","","","","",null,null,""]
[null,null,null,"S ’agit-il d’une classe simple ou à plusieurs niveaux ? (autre)","NIVECLASS6","A06X_NIVECLASS6",null,null,"donnée",null,null,"E7A_EC_FORMAT17S","S ’agit-il d’une classe simple ou à plusieurs niveaux ? (autre)",null,"","7ans","auto-questionnaire ecole","questionnaire enseignant","","","","","",null,null,""]
[null,null,null,"S ’agit-il d’une classe simple ou à plusieurs niveaux ? préciser","NIVECLASSP","A06X_NIVECLASSP",null,null,"non-disponible",null,null,"","S ’agit-il d’une classe simple ou à plusieurs niveaux ? préciser",null,"","7ans","auto-questionnaire ecole","questionnaire enseignant","","","","","",null,null,""]
[null,null,null,"En classe ou à la maison, vos élèves utilisent-ils un manuel d'apprentissage à la lecture ?","LECTMANU","A06X_LECTMANU",null,null,"donnée",null,null,"E7A_EC_FORMAT18S","En classe ou à la maison, vos élèves utilisent-ils un manuel d'apprentissage à la lecture ?",null,"","7ans","auto-questionnaire ecole","questionnaire enseignant","","","","","",null,null,""]
[null,null,null,"Titre du principal manuel utilisé en lecture","LECTMANUP","A06X_LECTMANUP",null,null,"non-disponible",null,null,"","Titre du principal manuel utilisé en lecture",null,"","7ans","auto-questionnaire ecole","questionnaire enseignant","","","","","",null,null,""]
[null,null,null,"Editeur du principal manuel utilisé en lecture","LECTMANUPP","A06X_LECTMANUPP",null,null,"non-disponible",null,null,"","Editeur du principal manuel utilisé en lecture",null,"","7ans","auto-questionnaire ecole","questionnaire enseignant","","","","","",null,null,""]
[null,null,null,"En classe ou à la maison, vos élèves utilisent-ils un fichier d'activités ou d'exercices en lecture ?","LECTFICH","A06X_LECTFICH",null,null,"donnée",null,null,"E7A_EC_FORMAT18S","En classe ou à la maison, vos élèves utilisent-ils un fichier d'activités ou d'exercices en lecture ?",null,"","7ans","auto-questionnaire ecole","questionnaire enseignant","","","","","",null,null,""]
[null,null,null,"Titre du principal fichier d'activités ou d'exercices utilisé en lecture","LECTFICHP","A06X_LECTFICHP",null,null,"non-disponible",null,null,"","Titre du principal fichier d'activités ou d'exercices utilisé en lecture",null,"","7ans","auto-questionnaire ecole","questionnaire enseignant","","","","","",null,null,""]
[null,null,null,"Editeur du principal fichier d'activités ou d'exercices utilisé en lecture","LECTFICHPP","A06X_LECTFICHPP",null,null,"non-disponible",null,null,"","Editeur du principal fichier d'activités ou d'exercices utilisé en lecture",null,"","7ans","auto-questionnaire ecole","questionnaire enseignant","","","","","",null,null,""]
[null,null,null,"En classe ou à la maison, vos élèves utilisent-ils un site internet d'apprentissage en lecture ?","LECTWEB","A06X_LECTWEB",null,null,"donnée",null,null,"E7A_EC_FORMAT18S","En classe ou à la maison, vos élèves utilisent-ils un site internet d'apprentissage en lecture ?",null,"","7ans","auto-questionnaire ecole","questionnaire enseignant","","","","","",null,null,""]
[null,null,null,"Titre du principal site internet d'apprentissage utilisé en lecture","LECTWEBP","A06X_LECTWEBP",null,null,"non-disponible",null,null,"","Titre du principal site internet d'apprentissage utilisé en lecture",null,"","7ans","auto-questionnaire ecole","questionnaire enseignant","","","","","",null,null,""]
[null,null,null,"Editeur du principal site internet d'apprentissage utilisé en lecture","LECTWEBPP","A06X_LECTWEBPP",null,null,"non-disponible",null,null,"","Editeur du principal site internet d'apprentissage utilisé en lecture",null,"","7ans","auto-questionnaire ecole","questionnaire enseignant","","","","","",null,null,""]
[null,null,null,"En classe ou à la maison, vos élèves utilisent-ils un logiciel d'apprentissage en lecture ?","LECTLOGI","A06X_LECTLOGI",null,null,"donnée",null,null,"E7A_EC_FORMAT18S","En classe ou à la maison, vos élèves utilisent-ils un logiciel d'apprentissage en lecture ?",null,"","7ans","auto-questionnaire ecole","questionnaire enseignant","","","","","",null,null,""]
[null,null,null,"Titre du principal logicel d'apprentissage utilisé en lecture","LECTLOGIP","A06X_LECTLOGIP",null,null,"non-disponible",null,null,"","Titre du principal logicel d'apprentissage utilisé en lecture",null,"","7ans","auto-questionnaire ecole","questionnaire enseignant","","","","","",null,null,""]
[null,null,null,"Editeur du principal logiciel d'apprentissage utilisé en lecture","LECTLOGIPP","A06X_LECTLOGIPP",null,null,"non-disponible",null,null,"","Editeur du principal logiciel d'apprentissage utilisé en lecture",null,"","7ans","auto-questionnaire ecole","questionnaire enseignant","","","","","",null,null,""]
[null,null,null,"En classe ou à la maison, vos élèves utilisent-ils un manuel d'apprentissage en mathématiques ?","MATHMANU","A06X_MATHMANU",null,null,"donnée",null,null,"E7A_EC_FORMAT18S","En classe ou à la maison, vos élèves utilisent-ils un manuel d'apprentissage en mathématiques ?",null,"","7ans","auto-questionnaire ecole","questionnaire enseignant","","","","","",null,null,""]
[null,null,null,"Titre du principal manuel utilisé en mathématiques","MATHMANUP","A06X_MATHMANUP",null,null,"non-disponible",null,null,"","Titre du principal manuel utilisé en mathématiques",null,"","7ans","auto-questionnaire ecole","questionnaire enseignant","","","","","",null,null,""]
[null,null,null,"Editeur du principal manuel utilisé en mathématiques","MATHMANUPP","A06X_MATHMANUPP",null,null,"non-disponible",null,null,"","Editeur du principal manuel utilisé en mathématiques",null,"","7ans","auto-questionnaire ecole","questionnaire enseignant","","","","","",null,null,""]
[null,null,null,"En classe ou à la maison, vos élèves utilisent-ils un fichier d'activités ou d'exercices en mathématiques ?","MATHFICH","A06X_MATHFICH",null,null,"donnée",null,null,"E7A_EC_FORMAT18S","En classe ou à la maison, vos élèves utilisent-ils un fichier d'activités ou d'exercices en mathématiques ?",null,"","7ans","auto-questionnaire ecole","questionnaire enseignant","","","","","",null,null,""]
[null,null,null,"Titre du principal fichier d'activités ou d'exercices utilisé en mathématiques","MATHFICHP","A06X_MATHFICHP",null,null,"non-disponible",null,null,"","Titre du principal fichier d'activités ou d'exercices utilisé en mathématiques",null,"","7ans","auto-questionnaire ecole","questionnaire enseignant","","","","","",null,null,""]
[null,null,null,"Editeur du principal fichier d'activités ou d'exercices utilisé en mathématiques","MATHFICHPP","A06X_MATHFICHPP",null,null,"non-disponible",null,null,"","Editeur du principal fichier d'activités ou d'exercices utilisé en mathématiques",null,"","7ans","auto-questionnaire ecole","questionnaire enseignant","","","","","",null,null,""]
[null,null,null,"En classe ou à la maison, vos élèves utilisent-ils un site internet d'apprentissage en mathématiques ?","MATHWEB","A06X_MATHWEB",null,null,"donnée",null,null,"E7A_EC_FORMAT18S","En classe ou à la maison, vos élèves utilisent-ils un site internet d'apprentissage en mathématiques ?",null,"","7ans","auto-questionnaire ecole","questionnaire enseignant","","","","","",null,null,""]
[null,null,null,"Titre du principal site internet d'apprentissage utilisé en mathématiques","MATHWEBP","A06X_MATHWEBP",null,null,"non-disponible",null,null,"","Titre du principal site internet d'apprentissage utilisé en mathématiques",null,"","7ans","auto-questionnaire ecole","questionnaire enseignant","","","","","",null,null,""]
[null,null,null,"Editeur du principal site internet d'apprentissage utilisé en mathématiques","MATHWEBPP","A06X_MATHWEBPP",null,null,"non-disponible",null,null,"","Editeur du principal site internet d'apprentissage utilisé en mathématiques",null,"","7ans","auto-questionnaire ecole","questionnaire enseignant","","","","","",null,null,""]
[null,null,null,"En classe ou à la maison, vos élèves utilisent-ils un logiciel d'apprentissage en mathématiques ?","MATHLOGI","A06X_MATHLOGI",null,null,"donnée",null,null,"E7A_EC_FORMAT18S","En classe ou à la maison, vos élèves utilisent-ils un logiciel d'apprentissage en mathématiques ?",null,"","7ans","auto-questionnaire ecole","questionnaire enseignant","","","","","",null,null,""]
[null,null,null,"Titre du principal logicel d'apprentissage utilisé en mathématiques","MATHLOGIP","A06X_MATHLOGIP",null,null,"non-disponible",null,null,"","Titre du principal logicel d'apprentissage utilisé en mathématiques",null,"","7ans","auto-questionnaire ecole","questionnaire enseignant","","","","","",null,null,""]
[null,null,null,"Editeur du principal logiciel d'apprentissage utilisé en mathématiques","MATHLOGIPP","A06X_MATHLOGIPP",null,null,"non-disponible",null,null,"","Editeur du principal logiciel d'apprentissage utilisé en mathématiques",null,"","7ans","auto-questionnaire ecole","questionnaire enseignant","","","","","",null,null,""]
[null,null,null,"Sexe de l'enseignant","ENSSEXE","A06X_ENSSEXE",null,null,"donnée",null,null,"E7A_EC_ENSSEXE","Sexe de l'enseignant",null,"","7ans","auto-questionnaire ecole","questionnaire enseignant","","","","","",null,null,""]
[null,null,null,"Age de l'enseignant","ENSAGE","A06X_ENSAGE",null,null,"donnée",null,null,"","Age de l'enseignant",null,"","7ans","auto-questionnaire ecole","questionnaire enseignant","","","","","",null,null,""]
[null,null,null,"Etes-vous l'enseignant habituel de cette classe ?","ENSHABIT","A06X_ENSHABIT",null,null,"donnée",null,null,"E7A_EC_ENSHABIT","Etes-vous l'enseignant habituel de cette classe ?",null,"","7ans","auto-questionnaire ecole","questionnaire enseignant","","","","","",null,null,""]
[null,null,null,"Depuis combien d’années enseignez-vous à ce niveau scolaire (y compris cette année) ?","ENSDUREE","A06X_ENSDUREE",null,null,"donnée",null,null,"","Depuis combien d’années enseignez-vous à ce niveau scolaire (y compris cette année) ?",null,"","7ans","auto-questionnaire ecole","questionnaire enseignant","","","","","",null,null,""]
[null,null,null,"Etes-vous titulaire, stagiaire ou contractuel ?","ENSSTATUT","A06X_ENSSTATUT",null,null,"donnée",null,null,"E7A_EC_ENSSTATUT","Etes-vous titulaire, stagiaire ou contractuel ?",null,"","7ans","auto-questionnaire ecole","questionnaire enseignant","","","","","",null,null,""]
[null,null,null,"Faites-vous partie d’associations ou de mouvements pédagogiques ?","ENSASSOC","A06X_ENSASSOC",null,null,"donnée",null,null,"E7A_EC_FORMAT18S","Faites-vous partie d’associations ou de mouvements pédagogiques ?",null,"","7ans","auto-questionnaire ecole","questionnaire enseignant","","","","","",null,null,""]
[null,null,null,"Faites-vous partie d’associations ou de mouvements pédagogiques ? préciser","ENSASSOCP","A06X_ENSASSOCP",null,null,"non-disponible",null,null,"","Faites-vous partie d’associations ou de mouvements pédagogiques ? préciser",null,"","7ans","auto-questionnaire ecole","questionnaire enseignant","","","","","",null,null,""]
[null,null,null,"Quel est votre diplôme le plus élevé ? baccalauréat","ENSDIPLOME1","A06X_ENSDIPLOME1",null,null,"donnée",null,null,"E7A_EC_FORMAT17S","Quel est votre diplôme le plus élevé ? baccalauréat",null,"","7ans","auto-questionnaire ecole","questionnaire enseignant","","","","","",null,null,""]
[null,null,null,"Quel est votre diplôme le plus élevé ? deug","ENSDIPLOME2","A06X_ENSDIPLOME2",null,null,"donnée",null,null,"E7A_EC_FORMAT17S","Quel est votre diplôme le plus élevé ? deug",null,"","7ans","auto-questionnaire ecole","questionnaire enseignant","","","","","",null,null,""]
[null,null,null,"Quel est votre diplôme le plus élevé ? licence","ENSDIPLOME3","A06X_ENSDIPLOME3",null,null,"donnée",null,null,"E7A_EC_FORMAT17S","Quel est votre diplôme le plus élevé ? licence",null,"","7ans","auto-questionnaire ecole","questionnaire enseignant","","","","","",null,null,""]
[null,null,null,"Quel est votre diplôme le plus élevé ? maîtrise ou master 1","ENSDIPLOME4","A06X_ENSDIPLOME4",null,null,"donnée",null,null,"E7A_EC_FORMAT17S","Quel est votre diplôme le plus élevé ? maîtrise ou master 1",null,"","7ans","auto-questionnaire ecole","questionnaire enseignant","","","","","",null,null,""]
[null,null,null,"Quel est votre diplôme le plus élevé ? dea, dess ou master 2","ENSDIPLOME5","A06X_ENSDIPLOME5",null,null,"donnée",null,null,"E7A_EC_FORMAT17S","Quel est votre diplôme le plus élevé ? dea, dess ou master 2",null,"","7ans","auto-questionnaire ecole","questionnaire enseignant","","","","","",null,null,""]
[null,null,null,"Quel est votre diplôme le plus élevé ? autre","ENSDIPLOME6","A06X_ENSDIPLOME6",null,null,"donnée",null,null,"E7A_EC_FORMAT17S","Quel est votre diplôme le plus élevé ? autre",null,"","7ans","auto-questionnaire ecole","questionnaire enseignant","","","","","",null,null,""]
[null,null,null,"Quel est votre diplôme le plus élevé ? préciser","ENSDIPLOMEP","A06X_ENSDIPLOMEP",null,null,"non-disponible",null,null,"","Quel est votre diplôme le plus élevé ? préciser",null,"","7ans","auto-questionnaire ecole","questionnaire enseignant","","","","","",null,null,""]
[null,null,null,"Avant la formation professionnelle, dans quel type de discipline avez-vous fait vos études, principalement ? lettres et langues","ENSDISCI1","A06X_ENSDISCI1",null,null,"donnée",null,null,"E7A_EC_FORMAT17S","Avant la formation professionnelle, dans quel type de discipline avez-vous fait vos études, principalement ? lettres et langues",null,"","7ans","auto-questionnaire ecole","questionnaire enseignant","","","","","",null,null,""]
[null,null,null,"Avant la formation professionnelle, dans quel type de discipline avez-vous fait vos études, principalement ? sciences humaines","ENSDISCI2","A06X_ENSDISCI2",null,null,"donnée",null,null,"E7A_EC_FORMAT17S","Avant la formation professionnelle, dans quel type de discipline avez-vous fait vos études, principalement ? sciences humaines",null,"","7ans","auto-questionnaire ecole","questionnaire enseignant","","","","","",null,null,""]
[null,null,null,"Avant la formation professionnelle, dans quel type de discipline avez-vous fait vos études, principalement ? sciences","ENSDISCI3","A06X_ENSDISCI3",null,null,"donnée",null,null,"E7A_EC_FORMAT17S","Avant la formation professionnelle, dans quel type de discipline avez-vous fait vos études, principalement ? sciences",null,"","7ans","auto-questionnaire ecole","questionnaire enseignant","","","","","",null,null,""]
[null,null,null,"Avant la formation professionnelle, dans quel type de discipline avez-vous fait vos études, principalement ? droit et sciences économiques","ENSDISCI4","A06X_ENSDISCI4",null,null,"donnée",null,null,"E7A_EC_FORMAT17S","Avant la formation professionnelle, dans quel type de discipline avez-vous fait vos études, principalement ? droit et sciences économiques",null,"","7ans","auto-questionnaire ecole","questionnaire enseignant","","","","","",null,null,""]
[null,null,null,"Avant la formation professionnelle, dans quel type de discipline avez-vous fait vos études, principalement ? autre","ENSDISCI5","A06X_ENSDISCI5",null,null,"donnée",null,null,"E7A_EC_FORMAT17S","Avant la formation professionnelle, dans quel type de discipline avez-vous fait vos études, principalement ? autre",null,"","7ans","auto-questionnaire ecole","questionnaire enseignant","","","","","",null,null,""]
[null,null,null,"Avant la formation professionnelle, dans quel type de discipline avez-vous fait vos études, principalement ? préciser","ENSDISCIP","A06X_ENSDISCIP",null,null,"non-disponible",null,null,"","Avant la formation professionnelle, dans quel type de discipline avez-vous fait vos études, principalement ? préciser",null,"","7ans","auto-questionnaire ecole","questionnaire enseignant","","","","","",null,0,""]
[null,null,null,"SCORES",null,null,null,null,null,null,null,null,null,null,null,null,null,null,null,null,null,null,null,null,1]
[null,null,null," Calcul mental de nb. dictés","SCCALCD","A06X_SCCALCD",null,null,"donnée",null,null,""," Calcul mental de nb. dictés",null,"","7ans","auto-questionnaire ecole","questionnaire enfant","Ecole"]
[null,null,null," Résolution de problèmes","SCPROB","A06X_SCPROB",null,null,"donnée",null,null,""," Résolution de problèmes",null,"","7ans","auto-questionnaire ecole","questionnaire enfant","Ecole"]
[null,null,null," Calcul mental pratique","SCCALCM","A06X_SCCALCM",null,null,"donnée",null,null,""," Calcul mental pratique",null,"","7ans","auto-questionnaire ecole","questionnaire enfant","Ecole"]
[null,null,null," Suites numériques","SCSUITE","A06X_SCSUITE",null,null,"donnée",null,null,""," Suites numériques",null,"","7ans","auto-questionnaire ecole","questionnaire enfant","Ecole"]
[null,null,null," Comparaison de nombres","SCCOMPA","A06X_SCCOMPA",null,null,"donnée",null,null,""," Comparaison de nombres",null,"","7ans","auto-questionnaire ecole","questionnaire enfant","Ecole"]
[null,null,null," Score moyen de math.","SCMOYMATH","A06X_SCMOYMATH",null,null,"donnée",null,null,""," Score moyen de math.",null,"","7ans","auto-questionnaire ecole","questionnaire enfant","Ecole"]
[null,null,null," Segm. phonétique","SCsegm","A06X_SCsegm",null,null,"donnée",null,null,""," Segm. phonétique",null,"","7ans","auto-questionnaire ecole","questionnaire enfant","Ecole"]
[null,null,null," Compréhension orale","SCcompO","A06X_SCcompO",null,null,"donnée",null,null,""," Compréhension orale",null,"","7ans","auto-questionnaire ecole","questionnaire enfant","Ecole"]
[null,null,null," Compréhension écrite","SCcompE","A06X_SCcompE",null,null,"donnée",null,null,""," Compréhension écrite",null,"","7ans","auto-questionnaire ecole","questionnaire enfant","Ecole"]
[null,null,null," Lecture","SClect","A06X_SClect",null,null,"donnée",null,null,""," Lecture",null,"","7ans","auto-questionnaire ecole","questionnaire enfant","Ecole"]
[null,null,null," Score moyen de lecture","SCmoylect","A06X_SCmoylect",null,null,"donnée",null,null,""," Score moyen de lecture",null,"","7ans","auto-questionnaire ecole","questionnaire enfant","Ecole"]
[null,null,null,"Score SDQ : échelle de troubles émotionnels",null,"A06X_SCORE_SDQ_EMO_6ANS",null,null,"donnée",null,null,null,"Score : échelle de troubles émotionnels (enquête école)",null,null,null,"auto-questionnaire ecole","questionnaire enseignant","Développement","Ecole"]
[null,null,null,"Score SDQ : échelle d'hyperactivité",null,"A06X_SCORE_SDQ_HYPER_6ANS",null,null,"donnée",null,null,null,"Score : échelle d'hyperactivité (enquête école)",null,null,null,"auto-questionnaire ecole","questionnaire enseignant","Développement","Ecole"]
[null,null,null,"Score SDQ : échelle prosocial",null,"A06X_SCORE_SDQ_PRO_6ANS",null,null,"donnée",null,null,null,"Score : échelle prosocial (enquête école)",null,null,null,"auto-questionnaire ecole","questionnaire enseignant","Développement","Ecole"]
[null,null,null,"Catégories score (normal, limite, anormal) : Troubles émotionnels",null,"A06X_SCORE_CAT_SDQ_EMO_6ANS",null,null,"donnée",null,null,"SDQ_ECOLE_COMPLET","Catégories score (normal, limite, anormal) : Troubles émotionnels (enquête école)",null,null,null,"auto-questionnaire ecole","questionnaire enseignant","Développement","Ecole"]
[null,null,null,"Catégories score (normal, limite, anormal) : Hyperactivité",null,"A06X_SCORE_CAT_SDQ_HYPER_6ANS",null,null,"donnée",null,null,"SDQ_ECOLE_COMPLET","Catégories score (normal, limite, anormal) : Hyperactivité (enquête école)\"",null,null,null,"auto-questionnaire ecole","questionnaire enseignant","Développement","Ecole"]
[null,null,null,"Catégories score (normal, limite, anormal) : Comportement prosocial",null,"A06X_SCORE_CAT_SDQ_PRO_6ANS",null,null,"donnée",null,null,"SDQ_ECOLE_COMPLET","Catégories score (normal, limite, anormal) : Comportement prosocial (enquête école)\"",null,null,null,"auto-questionnaire ecole","questionnaire enseignant","Développement","Ecole"]
[null,null,null,"Score Imes - Instrument de mesure de l’estime de soi",null,"A06X_IMES",null,null,"donnée",null,null,null,"Score Imes - Instrument de mesure de l’estime de soi"]
[null,null,null,"Score Imes Comportemental",null,"A06X_IMESComp",null,null,"donnée",null,null,null,"Score Imes Comportemental"]
[null,null,null,"Score Imes Général",null,"A06X_IMESGen",null,null,"donnée",null,null,null,"Score Imes Général"]
[null,null,null,"Score Imes Social",null,"A06X_IMESSoc",null,null,"donnée",null,null,null,"Score Imes Social"]
[null,null,null,"Score Imes Scolaire",null,"A06X_IMESScol",null,null,"donnée",null,null,null,"Score Imes Scolaire"]
[null,null,null,"Score Imes Standardisé",null,"A06X_IMESSTD",null,null,"donnée",null,null,null,"Score Imes Standardisé"]
[null,null,null,"Score Imes Standardisé Comportemental",null,"A06X_IMESSTDCOMP",null,null,"donnée",null,null,null,"Score Imes Standardisé Comportemental"]
[null,null,null,"Score Imes Standardisé Général",null,"A06X_IMESSTDGEN",null,null,"donnée",null,null,null,"Score Imes Standardisé Général"]
[null,null,null,"Score Imes Standardisé Scolaire",null,"A06X_IMESSTDSCOL",null,null,"donnée",null,null,null,"Score Imes Standardisé Scolaire"]
[null,null,null,"Score Imes Standardisé Social",null,"A06X_IMESSTDSOC",null,null,"donnée",null,null,null,"Score Imes Standardisé Social"]
[null,null,null,"Score Imes Factoriel",null,"A06X_IMESFACT",null,null,"donnée",null,null,null,"Score Imes Factoriel"]
[null,null,null,"Score Imes Factoriel Comportemental",null,"A06X_IMESFACTCOMP",null,null,"donnée",null,null,null,"Score Imes Factoriel Comportemental"]
[null,null,null,"Score Imes Factoriel Général",null,"A06X_IMESFACTGEN",null,null,"donnée",null,null,null,"Score Imes Factoriel Général"]
[null,null,null,"Score Imes Factoriel Scolaire",null,"A06X_IMESFACTSCOL",null,null,"donnée",null,null,null,"Score Imes Factoriel Scolaire"]
[null,null,null,"Score Imes Factoriel Social",null,"A06X_IMESFACTSOC",null,null,"donnée",null,null,null,"Score Imes Factoriel Social",null,null,null,null,null,null,null,null,null,null,null,0]

{"sheet":"E6A_JEU","index":7,"n_rows":133,"n_cols":75,"rows_kept":133,"cut":false,"hidden":false,"merged":[]}
["SELECTION\n(par variable ou par section)","SELECTION\n(par thème 1)","SELECTION\n(par QUEST STANDARD)","LABEL","QUESTION QUESTIONNAIRE","QUESTION BASE","QUESTION BASE",null,"TYPE","FORMAT","CHAPEAU","DICO","DESCRIPTION","CONTRÔLE","THEME(01)","THEME(02)","THEME(03)","THEME1","THEME2","THEME3","THEME4","THEME5","THEME6","QUEST STANDARD","THEME_TITRE","","","","","","","","","","","","","","","","","","","","","","","","","","","E7A_MBG","E7A_MBG","","","","","","","","","","","","","","","","","","","","","",""]
[null,null,null,{"$f":"CONCATENATE(\"Sélection totale : \",COUNTIFS(A:A,\"X\",I:I,\"*\")+COUNTIFS(B:B,\"X\",I:I,\"*\")+COUNTIFS(C:C,\"X\",I:I,\"*\"),\" variable(s)\")","v":"Sélection totale : 0 variable(s)"},null,null,null,null,null,null,null,null,null,null,null,null,null,null,null,null,null,null,null,null,null,null,{"$f":"COUNTIFS(A:A,\"X\",I:I,\"non-disponible\")+COUNTIFS(B:B,\"X\",I:I,\"non-disponible\")+COUNTIFS(C:C,\"X\",I:I,\"non-disponible\")","v":0},{"$f":"SUM(COUNTIFS($A:$A,\"X\",$E:$E,{\"ACRELI\";\"ACCHRET\";\"ACMUSUL\";\"LRELI\";\"QLCHRET\";\"QLMUSUL\";\"POLIT\"})+COUNTIFS($B:$B,\"X\",$E:$E,{\"ACRELI\";\"ACCHRET\";\"ACMUSUL\";\"LRELI\";\"QLCHRET\";\"QLMUSUL\";\"POLIT\"})+COUNTIFS($C:$C,\"X\",$E:$E,{\"ACRELI\";\"ACCHRET\";\"ACMUSUL\";\"LRELI\";\"QLCHRET\";\"QLMUSUL\";\"POLIT\"}))","v":0}]
[null,null,null,"GESTION",null,null,null,null,null,null,null,null,null,null,null,null,null,null,null,null,null,null,null,null,1]
[null,null,null,null,"VAGUE","A06E_VAGUE",null,null,"donnée"," BEST32.",null," E6AE_VAGUE.",null,null,null,null,null,null,null,null,null,null,"gestion"]
[null,null,null,"Date de création questionnaire","DCREAELFI","A06E_DCREAELFI",null,null,"non-disponible"," ",null," DDMMYY10.","Date de création questionnaire",null,null,null,null,null,null,null,null,null,"gestion"]
[null,null,null,"Initialisation questionnaire","CREAELFI","A06E_CREAELFI",null,null,"non-disponible"," ",null," E6AE_ON.","Initialisation questionnaire",null,null,null,null,null,null,null,null,null,"gestion"]
[null,null,null,"Date de modification : Jeu de la journée d'Elfi","ELFIDMODIF","A06E_ELFIDMODIF",null,null,"non-disponible"," ",null," DDMMYY10.","Date de modification : Jeu de la journée d'Elfi",null,null,null,null,null,null,null,null,null,"gestion"]
[null,null,null,"Jeu activités ","ELFI","A06E_ELFI",null,null,"donnée"," ",null," E6AE_ON.","Jeu activités ",null,null,null,null,null,null,null,null,null,"gestion"]
[null,null,null,"Nb de réponse jeu activités ","NREPELFI","A06E_NREPELFI",null,null,"donnée"," ",null," BEST12.","Nb de réponse jeu activités ",null,null,null,null,null,null,null,null,null,"gestion"]
[null,null,null,"Date de modification : Jeu des animaux","ANIMDMODIF","A06E_ANIMDMODIF",null,null,"non-disponible","date",null," DDMMYY10.","Date de modification : Jeu des animaux",null,null,null,null,null,null,null,null,null,"gestion"]
[null,null,null,"Jeu des animaux","ANIMAUX","A06E_ANIMAUX",null,null,"donnée","dico",null," E6AE_ON.","Jeu des animaux",null,null,null,null,null,null,null,null,null,"gestion"]
[null,null,null,"Nb de réponse jeu des animaux","NREPANIMAUX","A06E_NREPANIMAUX",null,null,"donnée","num",null,null,"Nb de réponse jeu des animaux",null,null,null,null,null,null,null,null,null,"gestion"]
[null,null,null,"Date de modification : Jeu des métiers","METDMODIF","A06E_METDMODIF",null,null,"non-disponible","date",null," DDMMYY10.","Date de modification : Jeu des métiers",null,null,null,null,null,null,null,null,null,"gestion"]
[null,null,null,"Jeu des métiers","METIER","A06E_METIER",null,null,"donnée","dico",null," E6AE_ON.","Jeu des métiers",null,null,null,null,null,null,null,null,null,"gestion"]
[null,null,null,"Nb de réponse jeu des métiers","NREPMETIER","A06E_NREPMETIER",null,null,"donnée","dico",null," BEST12.","Nb de réponse jeu des métiers",null,null,null,null,null,null,null,null,null,"gestion"]
[null,null,null,"pondération","pond","A06E_pond",null,null,"donnée","num",null," ","pondération",null,null,null,null,null,null,null,null,null,"gestion"]
[null,null,null,"A06E_AGEM=\"Age de [Enfant ELFE] à la date de début d’enquête (en mois)\"","AGEM","A06E_AGEM",null,null,"donnée","num",null,null,"A06E_AGEM=\"Age de [Enfant ELFE] à la date de début d’enquête (en mois)\"",null,null,null,null,null,null,null,null,null,"gestion"]
[null,null,null,"A06E_AGEAJR=\"Age de [Enfant ELFE] à la date de début d’enquête (en jours)\"","AGEAJR","A06E_AGEAJR",null,null,"non-disponible","num",null,null,"A06E_AGEAJR=\"Age de [Enfant ELFE] à la date de début d’enquête (en jours)\"",null,null,null,null,null,null,null,null,null,"gestion",null,0]
[null,null,null,"JEU ELFI",null,null,null,null,null,null,null,null,null,null,null,null,null,null,null,null,null,null,null,null,1]
[null,null,null,"Choisis ta couleur de peau","PEAU","A06E_PEAU",null,null,"donnée","dico",null," $E6AE_SKINC.","Choisis ta couleur de peau",null,null,null,null,null,null,null,null,null,"Jeu Elfi"]
[null,null,null,"Maintenant choisis ton bas et sa couleur.","HABITBAS","A06E_HABITBAS",null,null,"donnée","dico",null," E6AE_BAS.","Maintenant choisis ton bas et sa couleur.",null,null,null,null,null,null,null,null,null,"Jeu Elfi"]
[null,null,null,"Maintenant choisis ton bas et sa couleur.","HABITBASCOULEUR","A06E_HABITBASCOULEUR",null,null,"donnée","dico",null," $E6AE_HABIBASC.","Maintenant choisis ton bas et sa couleur.",null,null,null,null,null,null,null,null,null,"Jeu Elfi"]
[null,null,null,"C'est le matin. On va s'habiller. Tout d'abord choisis ton haut et sa couleur.","HABITHAUT","A06E_HABITHAUT",null,null,"donnée","dico",null," E6AE_HAUTS.","C'est le matin. On va s'habiller. Tout d'abord choisis ton haut et sa couleur.",null,null,null,null,null,null,null,null,null,"Jeu Elfi"]
[null,null,null,"C'est le matin. On va s'habiller. Tout d'abord choisis ton haut et sa couleur.","HABITHAUTCOULEUR","A06E_HABITHAUTCOULEUR",null,null,"donnée","dico",null," $E6AE_HABITC.","C'est le matin. On va s'habiller. Tout d'abord choisis ton haut et sa couleur.",null,null,null,null,null,null,null,null,null,"Jeu Elfi"]
[null,null,null,"Choisis tes chaussures","CHAUSSURES","A06E_CHAUSSURES",null,null,"donnée","dico",null," E6AE_CHAUSSURES.","Choisis tes chaussures",null,null,null,null,null,null,null,null,null,"Jeu Elfi"]
[null,null,null,"Choix couleur chaussures","CHAUSSURESCOULEUR","A06E_CHAUSSURESCOULEUR",null,null,"donnée","dico",null," $E6AE_SHOESC.","Choix couleur chaussures",null,null,null,null,null,null,null,null,null,"Jeu Elfi"]
[null,null,null,"Choisis tes accessoires. Tu peux en choisir plusieurs : Lunettes de soleil","ACCESSOIRES1","A06E_ACCESSOIRES1",null,null,"donnée","dico",null," E6AE_OUI.","Choisis tes accessoires. Tu peux en choisir plusieurs : Lunettes de soleil",null,null,null,null,null,null,null,null,null,"Jeu Elfi"]
[null,null,null,"Choisis tes accessoires. Tu peux en choisir plusieurs : Casquette","ACCESSOIRES2","A06E_ACCESSOIRES2",null,null,"donnée","dico",null," E6AE_OUI.","Choisis tes accessoires. Tu peux en choisir plusieurs : Casquette",null,null,null,null,null,null,null,null,null,"Jeu Elfi"]
[null,null,null,"Choisis tes accessoires. Tu peux en choisir plusieurs : Collier","ACCESSOIRES3","A06E_ACCESSOIRES3",null,null,"donnée","dico",null," E6AE_OUI.","Choisis tes accessoires. Tu peux en choisir plusieurs : Collier",null,null,null,null,null,null,null,null,null,"Jeu Elfi"]
[null,null,null,"Choisis tes accessoires. Tu peux en choisir plusieurs : Barrette-nœud","ACCESSOIRES4","A06E_ACCESSOIRES4",null,null,"donnée","dico",null," E6AE_OUI.","Choisis tes accessoires. Tu peux en choisir plusieurs : Barrette-nœud",null,null,null,null,null,null,null,null,null,"Jeu Elfi"]
[null,null,null,"Choisis tes accessoires. Tu peux en choisir plusieurs : Sac","ACCESSOIRES5","A06E_ACCESSOIRES5",null,null,"donnée","dico",null," E6AE_OUI.","Choisis tes accessoires. Tu peux en choisir plusieurs : Sac",null,null,null,null,null,null,null,null,null,"Jeu Elfi"]
[null,null,null,"Choisis tes accessoires. Tu peux en choisir plusieurs : Cartable","ACCESSOIRES6","A06E_ACCESSOIRES6",null,null,"donnée","dico",null," E6AE_OUI.","Choisis tes accessoires. Tu peux en choisir plusieurs : Cartable",null,null,null,null,null,null,null,null,null,"Jeu Elfi"]
[null,null,null,"Choisis tes accessoires. Tu peux en choisir plusieurs : Sac","ACCESSOIRES7","A06E_ACCESSOIRES7",null,null,"donnée","dico",null," E6AE_OUI.","Choisis tes accessoires. Tu peux en choisir plusieurs : Sac",null,null,null,null,null,null,null,null,null,"Jeu Elfi"]
[null,null,null,"Choisis la forme de tes cheveux","CHEVEUXFORME","A06E_CHEVEUXFORME",null,null,"donnée","dico",null," E6AE_CHEVEUX.","Choisis la forme de tes cheveux",null,null,null,null,null,null,null,null,null,"Jeu Elfi"]
[null,null,null,"Choisis la couleur de tes cheveux","CHEVEUXCOULEUR","A06E_CHEVEUXCOULEUR",null,null,"donnée","dico",null," $E6AE_HAIRC.","Choisis la couleur de tes cheveux",null,null,null,null,null,null,null,null,null,"Jeu Elfi"]
[null,null,null,"Qu'est-ce que tu aimes bien à l'école ? Tu peux choisir une, deux ou trois choses : Ta maîtresse ou ton maître ","AIMECOLE1","A06E_AIMECOLE1",null,null,"donnée","dico",null," E6AE_OUI.","Qu'est-ce que tu aimes bien à l'école ? Tu peux choisir une, deux ou trois choses : Ta maîtresse ou ton maître ",null,null,null,null,null,null,null,null,null,"Jeu Elfi"]
[null,null,null,"Qu'est-ce que tu aimes bien à l'école ? Tu peux choisir une, deux ou trois choses : Faire du travail dans la classe ","AIMECOLE2","A06E_AIMECOLE2",null,null,"donnée","dico",null," E6AE_OUI.","Qu'est-ce que tu aimes bien à l'école ? Tu peux choisir une, deux ou trois choses : Faire du travail dans la classe ",null,null,null,null,null,null,null,null,null,"Jeu Elfi"]
[null,null,null,"Qu'est-ce que tu aimes bien à l'école ? Tu peux choisir une, deux ou trois choses : Manger à la cantine ","AIMECOLE3","A06E_AIMECOLE3",null,null,"donnée","dico",null," E6AE_OUI.","Qu'est-ce que tu aimes bien à l'école ? Tu peux choisir une, deux ou trois choses : Manger à la cantine ",null,null,null,null,null,null,null,null,null,"Jeu Elfi"]
[null,null,null,"Qu'est-ce que tu aimes bien à l'école ? Tu peux choisir une, deux ou trois choses : Jouer avec les copains et les copines ","AIMECOLE4","A06E_AIMECOLE4",null,null,"donnée","dico",null," E6AE_OUI.","Qu'est-ce que tu aimes bien à l'école ? Tu peux choisir une, deux ou trois choses : Jouer avec les copains et les copines ",null,null,null,null,null,null,null,null,null,"Jeu Elfi"]
[null,null,null,"Qu'est-ce que tu aimes bien à l'école ? Tu peux choisir une, deux ou trois choses : Rester avec les animateurs, à la garderie","AIMECOLE5","A06E_AIMECOLE5",null,null,"donnée","dico",null," E6AE_OUI.","Qu'est-ce que tu aimes bien à l'école ? Tu peux choisir une, deux ou trois choses : Rester avec les animateurs, à la garderie",null,null,null,null,null,null,null,null,null,"Jeu Elfi"]
[null,null,null,"Qu'est-ce que tu aimes bien à l'école ? Tu peux choisir une, deux ou trois choses : Tu n’aimes pas l’école ","AIMECOLE6","A06E_AIMECOLE6",null,null,"donnée","dico",null," E6AE_OUI.","Qu'est-ce que tu aimes bien à l'école ? Tu peux choisir une, deux ou trois choses : Tu n’aimes pas l’école ",null,null,null,null,null,null,null,null,null,"Jeu Elfi"]
[null,null,null,"C’est la récréation ! Avec qui est-ce que tu veux jouer ? Tout seul ","RECREATION1","A06E_RECREATION1",null,null,"donnée","dico",null," E6AE_OUI.","C’est la récréation ! Avec qui est-ce que tu veux jouer ? Tout seul ",null,null,null,null,null,null,null,null,null,"Jeu Elfi"]
[null,null,null,"C’est la récréation ! Avec qui est-ce que tu veux jouer ? Avec ton meilleur copain ","RECREATION2","A06E_RECREATION2",null,null,"donnée","dico",null," E6AE_OUI.","C’est la récréation ! Avec qui est-ce que tu veux jouer ? Avec ton meilleur copain ",null,null,null,null,null,null,null,null,null,"Jeu Elfi"]
[null,null,null,"C’est la récréation ! Avec qui est-ce que tu veux jouer ? Avec ta meilleure copine ","RECREATION3","A06E_RECREATION3",null,null,"donnée","dico",null," E6AE_OUI.","C’est la récréation ! Avec qui est-ce que tu veux jouer ? Avec ta meilleure copine ",null,null,null,null,null,null,null,null,null,"Jeu Elfi"]
[null,null,null,"C’est la récréation ! Avec qui est-ce que tu veux jouer ? Avec un groupe de garçons ","RECREATION4","A06E_RECREATION4",null,null,"donnée","dico",null," E6AE_OUI.","C’est la récréation ! Avec qui est-ce que tu veux jouer ? Avec un groupe de garçons ",null,null,null,null,null,null,null,null,null,"Jeu Elfi"]
[null,null,null,"C’est la récréation ! Avec qui est-ce que tu veux jouer ? Avec un groupe de filles ","RECREATION5","A06E_RECREATION5",null,null,"donnée","dico",null," E6AE_OUI.","C’est la récréation ! Avec qui est-ce que tu veux jouer ? Avec un groupe de filles ",null,null,null,null,null,null,null,null,null,"Jeu Elfi"]
[null,null,null,"C’est la récréation ! Avec qui est-ce que tu veux jouer ? Avec un groupe de filles et de garçons ","RECREATION6","A06E_RECREATION6",null,null,"donnée","dico",null," E6AE_OUI.","C’est la récréation ! Avec qui est-ce que tu veux jouer ? Avec un groupe de filles et de garçons ",null,null,null,null,null,null,null,null,null,"Jeu Elfi"]
[null,null,null,"Qu'est-ce que tu as envie de faire ce matin ? Tu peux choisir une, deux ou trois choses : Jouer","ACTIMATIN1","A06E_ACTIMATIN1",null,null,"donnée","dico",null," E6AE_OUI.","Qu'est-ce que tu as envie de faire ce matin ? Tu peux choisir une, deux ou trois choses : Jouer",null,null,null,null,null,null,null,null,null,"Jeu Elfi"]
[null,null,null,"Qu'est-ce que tu as envie de faire ce matin ? Tu peux choisir une, deux ou trois choses : Regarder la télé","ACTIMATIN2","A06E_ACTIMATIN2",null,null,"donnée","dico",null," E6AE_OUI.","Qu'est-ce que tu as envie de faire ce matin ? Tu peux choisir une, deux ou trois choses : Regarder la télé",null,null,null,null,null,null,null,null,null,"Jeu Elfi"]
[null,null,null,"Qu'est-ce que tu as envie de faire ce matin ? Tu peux choisir une, deux ou trois choses : Manger quelque chose","ACTIMATIN3","A06E_ACTIMATIN3",null,null,"donnée","dico",null," E6AE_OUI.","Qu'est-ce que tu as envie de faire ce matin ? Tu peux choisir une, deux ou trois choses : Manger quelque chose",null,null,null,null,null,null,null,null,null,"Jeu Elfi"]
[null,null,null,"Qu'est-ce que tu as envie de faire ce matin ? Tu peux choisir une, deux ou trois choses : Boire quelque chose","ACTIMATIN4","A06E_ACTIMATIN4",null,null,"donnée","dico",null," E6AE_OUI.","Qu'est-ce que tu as envie de faire ce matin ? Tu peux choisir une, deux ou trois choses : Boire quelque chose",null,null,null,null,null,null,null,null,null,"Jeu Elfi"]
[null,null,null,"Qu'est-ce que tu as envie de faire ce matin ? Tu peux choisir une, deux ou trois choses : Faire ta toilette","ACTIMATIN5","A06E_ACTIMATIN5",null,null,"donnée","dico",null," E6AE_OUI.","Qu'est-ce que tu as envie de faire ce matin ? Tu peux choisir une, deux ou trois choses : Faire ta toilette",null,null,null,null,null,null,null,null,null,"Jeu Elfi"]
[null,null,null,"Qu'est-ce que tu as envie de faire ce matin ? Tu peux choisir une, deux ou trois choses : T'habiller tout seul","ACTIMATIN6","A06E_ACTIMATIN6",null,null,"donnée","dico",null," E6AE_OUI.","Qu'est-ce que tu as envie de faire ce matin ? Tu peux choisir une, deux ou trois choses : T'habiller tout seul",null,null,null,null,null,null,null,null,null,"Jeu Elfi"]
[null,null,null,"Qu'est-ce que tu as envie de faire ce matin ? Tu peux choisir une, deux ou trois choses : Partir à l'école","ACTIMATIN7","A06E_ACTIMATIN7",null,null,"donnée","dico",null," E6AE_OUI.","Qu'est-ce que tu as envie de faire ce matin ? Tu peux choisir une, deux ou trois choses : Partir à l'école",null,null,null,null,null,null,null,null,null,"Jeu Elfi"]
[null,null,null,"Qu'est-ce que tu as envie de faire ce matin ? Tu peux choisir une, deux ou trois choses : Rester au lit","ACTIMATIN8","A06E_ACTIMATIN8",null,null,"donnée","dico",null," E6AE_OUI.","Qu'est-ce que tu as envie de faire ce matin ? Tu peux choisir une, deux ou trois choses : Rester au lit",null,null,null,null,null,null,null,null,null,"Jeu Elfi"]
[null,null,null,"Maintenant, tu es à l'école. Choisis les activités que tu préfères. Tu peux en choisir une, deux ou trois : Ecrire (lettres) ","ACTICLASSE1","A06E_ACTICLASSE1",null,null,"donnée","dico",null," E6AE_OUI.","Maintenant, tu es à l'école. Choisis les activités que tu préfères. Tu peux en choisir une, deux ou trois : Ecrire (lettres) ",null,null,null,null,null,null,null,null,null,"Jeu Elfi"]
[null,null,null,"Maintenant, tu es à l'école. Choisis les activités que tu préfères. Tu peux en choisir une, deux ou trois : Jouer (ballon et peluche) ","ACTICLASSE2","A06E_ACTICLASSE2",null,null,"donnée","dico",null," E6AE_OUI.","Maintenant, tu es à l'école. Choisis les activités que tu préfères. Tu peux en choisir une, deux ou trois : Jouer (ballon et peluche) ",null,null,null,null,null,null,null,null,null,"Jeu Elfi"]
[null,null,null,"Maintenant, tu es à l'école. Choisis les activités que tu préfères. Tu peux en choisir une, deux ou trois : Peindre ou dessiner ","ACTICLASSE3","A06E_ACTICLASSE3",null,null,"donnée","dico",null," E6AE_OUI.","Maintenant, tu es à l'école. Choisis les activités que tu préfères. Tu peux en choisir une, deux ou trois : Peindre ou dessiner ",null,null,null,null,null,null,null,null,null,"Jeu Elfi"]
[null,null,null,"Maintenant, tu es à l'école. Choisis les activités que tu préfères. Tu peux en choisir une, deux ou trois : Regarder des livres ","ACTICLASSE4","A06E_ACTICLASSE4",null,null,"donnée","dico",null," E6AE_OUI.","Maintenant, tu es à l'école. Choisis les activités que tu préfères. Tu peux en choisir une, deux ou trois : Regarder des livres ",null,null,null,null,null,null,null,null,null,"Jeu Elfi"]
[null,null,null,"Maintenant, tu es à l'école. Choisis les activités que tu préfères. Tu peux en choisir une, deux ou trois : Chanter","ACTICLASSE5","A06E_ACTICLASSE5",null,null,"donnée","dico",null," E6AE_OUI.","Maintenant, tu es à l'école. Choisis les activités que tu préfères. Tu peux en choisir une, deux ou trois : Chanter",null,null,null,null,null,null,null,null,null,"Jeu Elfi"]
[null,null,null,"Maintenant, tu es à l'école. Choisis les activités que tu préfères. Tu peux en choisir une, deux ou trois : Faire des parcours ","ACTICLASSE7","A06E_ACTICLASSE7",null,null,"donnée","dico",null," E6AE_OUI.","Maintenant, tu es à l'école. Choisis les activités que tu préfères. Tu peux en choisir une, deux ou trois : Faire des parcours ",null,null,null,null,null,null,null,null,null,"Jeu Elfi"]
[null,null,null,"Maintenant, tu es à l'école. Choisis les activités que tu préfères. Tu peux en choisir une, deux ou trois : Ecouter une histoire","ACTICLASSE8","A06E_ACTICLASSE8",null,null,"donnée","dico",null," E6AE_OUI.","Maintenant, tu es à l'école. Choisis les activités que tu préfères. Tu peux en choisir une, deux ou trois : Ecouter une histoire",null,null,null,null,null,null,null,null,null,"Jeu Elfi"]
[null,null,null,"Voici une petite histoire qui se passe à l’école. C’est une histoire avec deux enfants. La maîtresse leur a demandé de faire un travail. L’un des enfants a très bien fait son travail. L’autre enfant n’a pas su faire aussi bien. La maîtresse va distribuer des bonbons. Clique sur ce que tu trouves le mieux.","BONBONS","A06E_BONBONS",null,null,"donnée","dico",null," E6AE_S06_BONBONS.","Voici une petite histoire qui se passe à l’école. C’est une histoire avec deux enfants. La maîtresse leur a demandé de faire un travail. L’un des enfants a très bien fait son travail. L’autre enfant n’a pas su faire aussi bien. La maîtresse va distribuer des bonbons. Clique sur ce que tu trouves le mieux.",null,null,null,null,null,null,null,null,null,"Jeu Elfi"]
[null,null,null,"Maintenant, tu es rentré à la maison. Choisis tes jouets préférés. Tu peux en choisir un, deux ou trois : Un livre","JOUETS1","A06E_JOUETS1",null,null,"donnée","dico",null," E6AE_OUI.","Maintenant, tu es rentré à la maison. Choisis tes jouets préférés. Tu peux en choisir un, deux ou trois : Un livre",null,null,null,null,null,null,null,null,null,"Jeu Elfi"]
[null,null,null,"Maintenant, tu es rentré à la maison. Choisis tes jouets préférés. Tu peux en choisir un, deux ou trois : Une poupée ","JOUETS2","A06E_JOUETS2",null,null,"donnée","dico",null," E6AE_OUI.","Maintenant, tu es rentré à la maison. Choisis tes jouets préférés. Tu peux en choisir un, deux ou trois : Une poupée ",null,null,null,null,null,null,null,null,null,"Jeu Elfi"]
[null,null,null,"Maintenant, tu es rentré à la maison. Choisis tes jouets préférés. Tu peux en choisir un, deux ou trois : Des petites voitures ","JOUETS3","A06E_JOUETS3",null,null,"donnée","dico",null," E6AE_OUI.","Maintenant, tu es rentré à la maison. Choisis tes jouets préférés. Tu peux en choisir un, deux ou trois : Des petites voitures ",null,null,null,null,null,null,null,null,null,"Jeu Elfi"]
[null,null,null,"Maintenant, tu es rentré à la maison. Choisis tes jouets préférés. Tu peux en choisir un, deux ou trois : Des jeux de construction (légos) ","JOUETS4","A06E_JOUETS4",null,null,"donnée","dico",null," E6AE_OUI.","Maintenant, tu es rentré à la maison. Choisis tes jouets préférés. Tu peux en choisir un, deux ou trois : Des jeux de construction (légos) ",null,null,null,null,null,null,null,null,null,"Jeu Elfi"]
[null,null,null,"Maintenant, tu es rentré à la maison. Choisis tes jouets préférés. Tu peux en choisir un, deux ou trois : Des jeux vidéo ","JOUETS5","A06E_JOUETS5",null,null,"donnée","dico",null," E6AE_OUI.","Maintenant, tu es rentré à la maison. Choisis tes jouets préférés. Tu peux en choisir un, deux ou trois : Des jeux vidéo ",null,null,null,null,null,null,null,null,null,"Jeu Elfi"]
[null,null,null,"Maintenant, tu es rentré à la maison. Choisis tes jouets préférés. Tu peux en choisir un, deux ou trois : Un déguisement de princesse ","JOUETS6","A06E_JOUETS6",null,null,"donnée","dico",null," E6AE_OUI.","Maintenant, tu es rentré à la maison. Choisis tes jouets préférés. Tu peux en choisir un, deux ou trois : Un déguisement de princesse ",null,null,null,null,null,null,null,null,null,"Jeu Elfi"]
[null,null,null,"Maintenant, tu es rentré à la maison. Choisis tes jouets préférés. Tu peux en choisir un, deux ou trois : Un déguisement de pirates ","JOUETS7","A06E_JOUETS7",null,null,"donnée","dico",null," E6AE_OUI.","Maintenant, tu es rentré à la maison. Choisis tes jouets préférés. Tu peux en choisir un, deux ou trois : Un déguisement de pirates ",null,null,null,null,null,null,null,null,null,"Jeu Elfi"]
[null,null,null,"Maintenant, tu es rentré à la maison. Choisis tes jouets préférés. Tu peux en choisir un, deux ou trois : Une dînette ","JOUETS8","A06E_JOUETS8",null,null,"donnée","dico",null," E6AE_OUI.","Maintenant, tu es rentré à la maison. Choisis tes jouets préférés. Tu peux en choisir un, deux ou trois : Une dînette ",null,null,null,null,null,null,null,null,null,"Jeu Elfi"]
[null,null,null,"Maintenant, tu es rentré à la maison. Choisis tes jouets préférés. Tu peux en choisir un, deux ou trois : Des petits personnages ","JOUETS9","A06E_JOUETS9",null,null,"donnée","dico",null," E6AE_OUI.","Maintenant, tu es rentré à la maison. Choisis tes jouets préférés. Tu peux en choisir un, deux ou trois : Des petits personnages ",null,null,null,null,null,null,null,null,null,"Jeu Elfi"]
[null,null,null,"Maintenant, tu es rentré à la maison. Choisis tes jouets préférés. Tu peux en choisir un, deux ou trois : Un jeu (jeu de l’oie) ","JOUETS10","A06E_JOUETS10",null,null,"donnée","dico",null," E6AE_OUI.","Maintenant, tu es rentré à la maison. Choisis tes jouets préférés. Tu peux en choisir un, deux ou trois : Un jeu (jeu de l’oie) ",null,null,null,null,null,null,null,null,null,"Jeu Elfi"]
[null,null,null,"Si tu veux, tu peux rester avec tes jouets préférés. Si tu préfères, tu peux aller regarder la télé. Clique pour choisir ce que tu veux.","JOUETSTV","A06E_JOUETSTV",null,null,"donnée","dico",null," E6AE_S10_JOUETS_PREFERES.","Si tu veux, tu peux rester avec tes jouets préférés. Si tu préfères, tu peux aller regarder la télé. Clique pour choisir ce que tu veux.",null,null,null,null,null,null,null,null,null,"Jeu Elfi"]
[null,null,null,"Maintenant, c'est le soir. On a bien joué. Avec qui est-ce que tu veux manger ?","MANGER","A06E_MANGER",null,null,"donnée","dico",null," E6AE_S12_MANGER.","Maintenant, c'est le soir. On a bien joué. Avec qui est-ce que tu veux manger ?",null,null,null,null,null,null,null,null,null,"Jeu Elfi"]
[null,null,null,"Est-ce que tu veux manger avec la télé ?","MANGERTV","A06E_MANGERTV",null,null,"donnée","dico",null," E6AE_S12B_MANGERTV.","Est-ce que tu veux manger avec la télé ?",null,null,null,null,null,null,null,null,null,"Jeu Elfi"]
[null,null,null,"Voilà, on a bien mangé. On va se préparer à aller dormir. Est-ce que tu eux quelque chose pour aller dormir ? Tu peux choisir une, deux ou trois choses : Un doudou (nounours)  ","DORMIR1","A06E_DORMIR1",null,null,"donnée","dico",null," E6AE_OUI.","Voilà, on a bien mangé. On va se préparer à aller dormir. Est-ce que tu eux quelque chose pour aller dormir ? Tu peux choisir une, deux ou trois choses : Un doudou (nounours)  ",null,null,null,null,null,null,null,null,null,"Jeu Elfi"]
[null,null,null,"Voilà, on a bien mangé. On va se préparer à aller dormir. Est-ce que tu eux quelque chose pour aller dormir ? Tu peux choisir une, deux ou trois choses : Une histoire ","DORMIR3","A06E_DORMIR3",null,null,"donnée","dico",null," E6AE_OUI.","Voilà, on a bien mangé. On va se préparer à aller dormir. Est-ce que tu eux quelque chose pour aller dormir ? Tu peux choisir une, deux ou trois choses : Une histoire ",null,null,null,null,null,null,null,null,null,"Jeu Elfi"]
[null,null,null,"Voilà, on a bien mangé. On va se préparer à aller dormir. Est-ce que tu eux quelque chose pour aller dormir ? Tu peux choisir une, deux ou trois choses : Un verre d’eau ","DORMIR4","A06E_DORMIR4",null,null,"donnée","dico",null," E6AE_OUI.","Voilà, on a bien mangé. On va se préparer à aller dormir. Est-ce que tu eux quelque chose pour aller dormir ? Tu peux choisir une, deux ou trois choses : Un verre d’eau ",null,null,null,null,null,null,null,null,null,"Jeu Elfi"]
[null,null,null,"Voilà, on a bien mangé. On va se préparer à aller dormir. Est-ce que tu eux quelque chose pour aller dormir ? Tu peux choisir une, deux ou trois choses : Un câlin ","DORMIR5","A06E_DORMIR5",null,null,"donnée","dico",null," E6AE_OUI.","Voilà, on a bien mangé. On va se préparer à aller dormir. Est-ce que tu eux quelque chose pour aller dormir ? Tu peux choisir une, deux ou trois choses : Un câlin ",null,null,null,null,null,null,null,null,null,"Jeu Elfi"]
[null,null,null,"Voilà, on a bien mangé. On va se préparer à aller dormir. Est-ce que tu eux quelque chose pour aller dormir ? Tu peux choisir une, deux ou trois choses : Une tétine ","DORMIR6","A06E_DORMIR6",null,null,"donnée","dico",null," E6AE_OUI.","Voilà, on a bien mangé. On va se préparer à aller dormir. Est-ce que tu eux quelque chose pour aller dormir ? Tu peux choisir une, deux ou trois choses : Une tétine ",null,null,null,null,null,null,null,null,null,"Jeu Elfi"]
[null,null,null,"Voilà, on a bien mangé. On va se préparer à aller dormir. Est-ce que tu eux quelque chose pour aller dormir ? Tu peux choisir une, deux ou trois choses : De la lumière (lampe)","DORMIR7","A06E_DORMIR7",null,null,"donnée","dico",null," E6AE_OUI.","Voilà, on a bien mangé. On va se préparer à aller dormir. Est-ce que tu eux quelque chose pour aller dormir ? Tu peux choisir une, deux ou trois choses : De la lumière (lampe)",null,null,null,null,null,null,null,null,null,"Jeu Elfi"]
[null,null,null,"Voilà, on a bien mangé. On va se préparer à aller dormir. Est-ce que tu eux quelque chose pour aller dormir ? Tu peux choisir une, deux ou trois choses : De la musique (disque) ","DORMIR8","A06E_DORMIR8",null,null,"donnée","dico",null," E6AE_OUI.","Voilà, on a bien mangé. On va se préparer à aller dormir. Est-ce que tu eux quelque chose pour aller dormir ? Tu peux choisir une, deux ou trois choses : De la musique (disque) ",null,null,null,null,null,null,null,null,null,"Jeu Elfi",null,0]
[null,null,null,"JEU DES ANIMAUX",null,null,null,null,null,null,null,null,null,null,null,null,null,null,null,null,null,null,null,null,1]
[null,null,null,"Action chat","ACTCHA","A06E_ACTCHA",null,null,"donnée","dico",null," E6AE_ACTION.","Action chat",null,null,null,null,null,null,null,null,null,"Jeu des animaux"]
[null,null,null,"Action chien","ACTCHI","A06E_ACTCHI",null,null,"donnée","dico",null," E6AE_ACTION.","Action chien",null,null,null,null,null,null,null,null,null,"Jeu des animaux"]
[null,null,null,"Action lion","ACTLIO","A06E_ACTLIO",null,null,"donnée","dico",null," E6AE_ACTION.","Action lion",null,null,null,null,null,null,null,null,null,"Jeu des animaux"]
[null,null,null,"Action oiseau","ACTOIS","A06E_ACTOIS",null,null,"donnée","dico",null," E6AE_ACTION.","Action oiseau",null,null,null,null,null,null,null,null,null,"Jeu des animaux"]
[null,null,null,"Action ours","ACTOUR","A06E_ACTOUR",null,null,"donnée","dico",null," E6AE_ACTION.","Action ours",null,null,null,null,null,null,null,null,null,"Jeu des animaux"]
[null,null,null,"D’après toi, lequel de ces animaux est le plus beau ?   (choix unique, modalités proposées dans un ordre aléatoire)","BEAU","A06E_BEAU",null,null,"donnée","dico",null," E6AE_ANIMAUX.","D’après toi, lequel de ces animaux est le plus beau ?   (choix unique, modalités proposées dans un ordre aléatoire)",null,null,null,null,null,null,null,null,null,"Jeu des animaux"]
[null,null,null,"Lequel est le plus bête ?    (choix unique, modalités proposées dans un ordre aléatoire)","BETE","A06E_BETE",null,null,"donnée","dico",null," E6AE_ANIMAUX.","Lequel est le plus bête ?    (choix unique, modalités proposées dans un ordre aléatoire)",null,null,null,null,null,null,null,null,null,"Jeu des animaux"]
[null,null,null,"Lequel est le plus fort ?  (choix unique, modalités proposées dans un ordre aléatoire)","FORT","A06E_FORT",null,null,"donnée","dico",null," E6AE_ANIMAUX.","Lequel est le plus fort ?  (choix unique, modalités proposées dans un ordre aléatoire)",null,null,null,null,null,null,null,null,null,"Jeu des animaux"]
[null,null,null,"Lequel est le moins fort, le plus fragile ?  (choix unique, modalités proposées dans un ordre aléatoire)","FRAGILE","A06E_FRAGILE",null,null,"donnée","dico",null," E6AE_ANIMAUX.","Lequel est le moins fort, le plus fragile ?  (choix unique, modalités proposées dans un ordre aléatoire)",null,null,null,null,null,null,null,null,null,"Jeu des animaux"]
[null,null,null,"D’après toi, lequel de ces animaux est le plus gentil ?  (choix unique, modalités proposées dans un ordre aléatoire)","GENTIL","A06E_GENTIL",null,null,"donnée","dico",null," E6AE_ANIMAUX.","D’après toi, lequel de ces animaux est le plus gentil ?  (choix unique, modalités proposées dans un ordre aléatoire)",null,null,null,null,null,null,null,null,null,"Jeu des animaux"]
[null,null,null,"Lequel est le plus malin, le plus intelligent ?   (choix unique, modalités proposées dans un ordre aléatoire)","MALIN","A06E_MALIN",null,null,"donnée","dico",null," E6AE_ANIMAUX.","Lequel est le plus malin, le plus intelligent ?   (choix unique, modalités proposées dans un ordre aléatoire)",null,null,null,null,null,null,null,null,null,"Jeu des animaux"]
[null,null,null,"D’après toi, lequel de ces animaux est le plus méchant ?  (choix unique, modalités proposées dans un ordre aléatoire)","MECHANT","A06E_MECHANT",null,null,"donnée","dico",null," E6AE_ANIMAUX.","D’après toi, lequel de ces animaux est le plus méchant ?  (choix unique, modalités proposées dans un ordre aléatoire)",null,null,null,null,null,null,null,null,null,"Jeu des animaux"]
[null,null,null,"Lequel est le moins beau ?  (choix unique, modalités proposées dans un ordre aléatoire)","MOCHE","A06E_MOCHE",null,null,"donnée","num",null," ","Lequel est le moins beau ?  (choix unique, modalités proposées dans un ordre aléatoire)",null,null,null,null,null,null,null,null,null,"Jeu des animaux"]
[null,null,null,"Et quel animal tu ne voudrais pas du tout être ?  (choix unique, modalités proposées dans un ordre aléatoire)","PASETREANIMAL","A06E_PASETREANIMAL",null,null,"donnée","dico",null," E6AE_ANIMAUX.","Et quel animal tu ne voudrais pas du tout être ?  (choix unique, modalités proposées dans un ordre aléatoire)",null,null,null,null,null,null,null,null,null,"Jeu des animaux"]
[null,null,null,"Et toi, si tu étais un animal, quel animal voudrais-tu être ?  (choix unique, modalités proposées dans un ordre aléatoire) ","ETREANIMAL","A06E_ETREANIMAL",null,null,"donnée","dico",null," E6AE_ANIMAUX.","Et toi, si tu étais un animal, quel animal voudrais-tu être ?  (choix unique, modalités proposées dans un ordre aléatoire) ",null,null,null,null,null,null,null,null,null,"Jeu des animaux"]
[null,null,null,"D’après toi, quel objet Loulou va-t-il apporter pour que le voleur accepte de lui rendre sa nourriture ? ","OBJET","A06E_OBJET",null,null,"donnée","dico",null," E6AE_OBJET.","D’après toi, quel objet Loulou va-t-il apporter pour que le voleur accepte de lui rendre sa nourriture ? ",null,null,null,null,null,null,null,null,null,"Jeu des animaux"]
[null,null,null,"Place de la modalité cochée","BEAUPLACE","A06E_BEAUPLACE",null,null,"donnée","num",null," ","Place de la modalité cochée",null,null,null,null,null,null,null,null,null,"Jeu des animaux"]
[null,null,null,"Place de la modalité cochée","BETEPLACE","A06E_BETEPLACE",null,null,"donnée","num",null," ","Place de la modalité cochée",null,null,null,null,null,null,null,null,null,"Jeu des animaux"]
[null,null,null,"Place de la modalité cochée","FORTPLACE","A06E_FORTPLACE",null,null,"donnée","num",null," ","Place de la modalité cochée",null,null,null,null,null,null,null,null,null,"Jeu des animaux"]
[null,null,null,"Place de la modalité cochée ","FRAGILEPLACE","A06E_FRAGILEPLACE",null,null,"donnée","num",null," ","Place de la modalité cochée ",null,null,null,null,null,null,null,null,null,"Jeu des animaux"]
[null,null,null,"Place de la modalité cochée","GENTILPLACE","A06E_GENTILPLACE",null,null,"donnée","num",null," ","Place de la modalité cochée",null,null,null,null,null,null,null,null,null,"Jeu des animaux"]
[null,null,null,"Place de la modalité cochée","MALINPLACE","A06E_MALINPLACE",null,null,"donnée","num",null," ","Place de la modalité cochée",null,null,null,null,null,null,null,null,null,"Jeu des animaux"]
[null,null,null,"Place de la modalité cochée ","MECHANTPLACE","A06E_MECHANTPLACE",null,null,"donnée","num",null," ","Place de la modalité cochée ",null,null,null,null,null,null,null,null,null,"Jeu des animaux"]
[null,null,null,"Place de la modalité cochée","MOCHEPLACE","A06E_MOCHEPLACE",null,null,"donnée","num",null," ","Place de la modalité cochée",null,null,null,null,null,null,null,null,null,"Jeu des animaux"]
[null,null,null,"Place de la modalité cochée","PASETREANIMALPLACE","A06E_PASETREANIMALPLACE",null,null,"donnée","num",null," ","Place de la modalité cochée",null,null,null,null,null,null,null,null,null,"Jeu des animaux"]
[null,null,null,"Place de la modalité cochée","ETREANIMALPLACE","A06E_ETREANIMALPLACE",null,null,"donnée","num",null," ","Place de la modalité cochée",null,null,null,null,null,null,null,null,null,"Jeu des animaux"]
[null,null,null,"En entendant cela, Loulou se demande ce qu’il va faire. D’après toi, que décide de faire Loulou ? (choix unique, modalités proposées dans l'ordre indiqué)","SANCTION","A06E_SANCTION",null,null,"donnée","num",null," ","En entendant cela, Loulou se demande ce qu’il va faire. D’après toi, que décide de faire Loulou ? (choix unique, modalités proposées dans l'ordre indiqué)",null,null,null,null,null,null,null,null,null,"Jeu des animaux",null,0]
[null,null,null,"LES MÉTIERS",null,null,null,null,null,null,null,null,null,null,null,null,null,null,null,null,null,null,null,null,1]
[null,null,null,"Demande à quelqu’un d’écrire ton métier préféré dans la case. Quand tu as fini, clique sur la flèche verte pour continuer le jeu.","METPREFc","A06E_METPREFc",null,null,"non-disponible","texte",null," $32.","Demande à quelqu’un d’écrire ton métier préféré dans la case. Quand tu as fini, clique sur la flèche verte pour continuer le jeu.",null,null,null,null,null,null,null,null,null,"Les métiers"]
[null,null,null,"Demande de l’aide pour écrire dans la case ce travail que tu n’aimerais pas du tout faire. Quand tu as fini, clique sur la flèche verte pour continuer le jeu.","METDETESTc","A06E_METDETESTc",null,null,"non-disponible","texte",null," $32.","Demande de l’aide pour écrire dans la case ce travail que tu n’aimerais pas du tout faire. Quand tu as fini, clique sur la flèche verte pour continuer le jeu.",null,null,null,null,null,null,null,null,null,"Les métiers"]
[null,null,null,"Commence par cliquer sur le métier que tu aimes le plus.","MET1","A06E_MET1",null,null,"donnée","dico",null," E6AE_METIER4V.","Commence par cliquer sur le métier que tu aimes le plus.",null,null,null,null,null,null,null,null,null,"Les métiers"]
[null,null,null,"D’accord, choisis maintenant celui que tu préfères, celui que tu aimes le plus, dans ceux qui restent.","MET2","A06E_MET2",null,null,"donnée","dico",null," E6AE_METIER4V.","D’accord, choisis maintenant celui que tu préfères, celui que tu aimes le plus, dans ceux qui restent.",null,null,null,null,null,null,null,null,null,"Les métiers"]
[null,null,null,"Très bien, continue et choisis celui que tu aimes le plus dans ceux qui restent.","MET3","A06E_MET3",null,null,"donnée","dico",null," E6AE_METIER4V.","Très bien, continue et choisis celui que tu aimes le plus dans ceux qui restent.",null,null,null,null,null,null,null,null,null,"Les métiers"]
[null,null,null,"D’accord, continue et choisis celui que tu aimes le plus dans les trois qui restent.","MET4","A06E_MET4",null,null,"donnée","dico",null," E6AE_METIER4V.","D’accord, continue et choisis celui que tu aimes le plus dans les trois qui restent.",null,null,null,null,null,null,null,null,null,"Les métiers"]
[null,null,null,"Très bien, continue et choisis celui des deux que tu aimes le plus. ","MET5","A06E_MET5",null,null,"donnée","dico",null," E6AE_METIER4V.","Très bien, continue et choisis celui des deux que tu aimes le plus. ",null,null,null,null,null,null,null,null,null,"Les métiers"]
[null,null,null,"D’accord, clique sur le dernier.","MET6","A06E_MET6",null,null,"donnée","dico",null," E6AE_METIER4V.","D’accord, clique sur le dernier.",null,null,null,null,null,null,null,null,null,"Les métiers"]
[null,null,null,"Pour commencer, fais un premier mariage en cliquant sur la première personne que tu veux marier.","MARIE11","A06E_MARIE11",null,null,"donnée","dico",null," E6AE_METIER.","Pour commencer, fais un premier mariage en cliquant sur la première personne que tu veux marier.",null,null,null,null,null,null,null,null,null,"Les métiers"]
[null,null,null,"(2e personne du premier mariage) ","MARIE12","A06E_MARIE12",null,null,"donnée","dico",null," E6AE_METIER.","(2e personne du premier mariage) ",null,null,null,null,null,null,null,null,null,"Les métiers"]
[null,null,null,"D’accord, fais un 2e mariage. Clique sur la personne que tu veux marier maintenant.","MARIE21","A06E_MARIE21",null,null,"donnée","dico",null," E6AE_METIER.","D’accord, fais un 2e mariage. Clique sur la personne que tu veux marier maintenant.",null,null,null,null,null,null,null,null,null,"Les métiers"]
[null,null,null,"(2e personne du 2e mariage)","MARIE22","A06E_MARIE22",null,null,"donnée","dico",null," E6AE_METIER.","(2e personne du 2e mariage)",null,null,null,null,null,null,null,null,null,"Les métiers"]
[null,null,null,"Très bien, fais maintenant le 3e mariage. Clique sur la personne que tu veux marier.","MARIE31","A06E_MARIE31",null,null,"donnée","dico",null," E6AE_METIER.","Très bien, fais maintenant le 3e mariage. Clique sur la personne que tu veux marier.",null,null,null,null,null,null,null,null,null,"Les métiers"]
[null,null,null,"(2e personne du 3e mariage)","MARIE32","A06E_MARIE32",null,null,"donnée","dico",null," E6AE_METIER.","(2e personne du 3e mariage)",null,null,null,null,null,null,null,null,null,"Les métiers"]
[null,null,null,"Choisis dans quelle équipe tu préfèrerais travailler quand tu seras adulte. ","EQUIP","A06E_EQUIP",null,null,"donnée","dico",null," E6AE_CHOIXUSINE.","Choisis dans quelle équipe tu préfèrerais travailler quand tu seras adulte. ",null,null,null,null,null,null,null,null,null,"Les métiers"]
[null,null,null,"Et toi, qu’en penses-tu ? Ecoute les 3 possibilités et clique sur celle que tu préfères.","ARGENT","A06E_ARGENT",null,null,"donnée","dico",null," E6AE_SALAIRE.","Et toi, qu’en penses-tu ? Ecoute les 3 possibilités et clique sur celle que tu préfères.",null,null,null,null,null,null,null,null,null,"Les métiers"]
[null,null,null,"Pour commencer, tu vas placer le pilote. A ton avis, où habite-t-il ?","PILOTVIL","A06E_PILOTVIL",null,null,"donnée","dico",null," E6AE_EMPLACEMENT.","Pour commencer, tu vas placer le pilote. A ton avis, où habite-t-il ?",null,null,null,null,null,null,null,null,null,"Les métiers"]
[null,null,null,"D’accord, maintenant tu vas placer la maîtresse. A ton avis, où habite-t-elle ? Tu peux la placer dans n’importe lequel des 4 endroits.","MAITRESVIL","A06E_MAITRESVIL",null,null,"donnée","dico",null," E6AE_EMPLACEMENT.","D’accord, maintenant tu vas placer la maîtresse. A ton avis, où habite-t-elle ? Tu peux la placer dans n’importe lequel des 4 endroits.",null,null,null,null,null,null,null,null,null,"Les métiers"]
[null,null,null,"D’accord, tu vas placer maintenant l’ouvrier. A ton avis, où habite-t-il ?","OUVRVIL","A06E_OUVRVIL",null,null,"donnée","dico",null," E6AE_EMPLACEMENT.","D’accord, tu vas placer maintenant l’ouvrier. A ton avis, où habite-t-il ?",null,null,null,null,null,null,null,null,null,"Les métiers"]
[null,null,null,"Très bien, tu vas placer maintenant la factrice. A ton avis, où habite-t-elle ?","FACTRVIL","A06E_FACTRVIL",null,null,"donnée","dico",null," E6AE_EMPLACEMENT.","Très bien, tu vas placer maintenant la factrice. A ton avis, où habite-t-elle ?",null,null,null,null,null,null,null,null,null,"Les métiers"]
[null,null,null,"Pour terminer, clique sur l’endroit qui ressemble le plus à chez toi.","ELFEVIL","A06E_ELFEVIL",null,null,"donnée","dico",null," E6AE_EMPLACEMENT.","Pour terminer, clique sur l’endroit qui ressemble le plus à chez toi.",null,null,null,null,null,null,null,null,null,"Les métiers",null,0]

{"sheet":"E7A_MBG","index":8,"n_rows":208,"n_cols":75,"rows_kept":208,"cut":false,"hidden":false,"merged":[]}
["SELECTION\n(par variable ou par section)","SELECTION\n(par thème 1)","SELECTION\n(par QUEST STANDARD)","LABEL","QUESTION QUESTIONNAIRE","QUESTION BASE","QUESTION BASE",null,"TYPE","FORMAT","CHAPEAU","DICO","DESCRIPTION","CONTRÔLE","THEME(01)","THEME(02)","THEME(03)","THEME1","THEME2","THEME3","THEME4","THEME5","THEME6","QUEST STANDARD","THEME_TITRE","","","","","","","","","","","","","","","","","","","","","","","","","","","E7A_MBG","E7A_MBG","","","","","","","","","","","","","","","","","","","","","",""]
[null,null,null,{"$f":"CONCATENATE(\"Sélection totale : \",COUNTIFS(A:A,\"X\",I:I,\"*\")+COUNTIFS(B:B,\"X\",I:I,\"*\")+COUNTIFS(C:C,\"X\",I:I,\"*\"),\" variable(s)\")","v":"Sélection totale : 0 variable(s)"},null,null,null,null,null,null,null,null,null,null,null,null,null,null,null,null,null,null,null,null,null,null,{"$f":"COUNTIFS(A:A,\"X\",I:I,\"non-disponible\")+COUNTIFS(B:B,\"X\",I:I,\"non-disponible\")+COUNTIFS(C:C,\"X\",I:I,\"non-disponible\")","v":0},{"$f":"SUM(COUNTIFS($A:$A,\"X\",$E:$E,{\"ACRELI\";\"ACCHRET\";\"ACMUSUL\";\"LRELI\";\"QLCHRET\";\"QLMUSUL\";\"POLIT\"})+COUNTIFS($B:$B,\"X\",$E:$E,{\"ACRELI\";\"ACCHRET\";\"ACMUSUL\";\"LRELI\";\"QLCHRET\";\"QLMUSUL\";\"POLIT\"})+COUNTIFS($C:$C,\"X\",$E:$E,{\"ACRELI\";\"ACCHRET\";\"ACMUSUL\";\"LRELI\";\"QLCHRET\";\"QLMUSUL\";\"POLIT\"}))","v":0}]
[null,null,null,"INFORMATIONS GÉNÉRALES",null,null,null,null,null,null,null,null,null,null,null,null,null,null,null,null,null,null,null,null,1]
[null,null,null,"pondération enquete 7 ans - Q complets avec ou sans le module puberté","PONDREF","A07E_PONDREF",null,null,"donnée","num"]
[null,null,null,"pondération enquete 7 ans - Q complets y compris module puberté","PONDREF_PUBERTE","A07E_PONDREF_PUBERTE",null,null,"donnée","num"]
[null,null,null,"Type questionnaire (PAPIER/WEB)","TYP","A07R_TYP",null,null,"donnée","dico",null,"E7A_TQ",null,null,"réferent","Gestion étude",null,null,null,null,null,null,"Informations générales"]
[null,null,null,"Vous êtes :","QREP","A07R_QREP",null,null,"donnée","dico",null,"E7A_REPOND",null,null,"réferent","Gestion étude",null,null,null,null,null,null,"Informations générales"]
[null,null,null,"L’enfant qui participe à l’étude Elfe est :","SEXENF","A07R_SEXENF",null,null,"donnée","dico",null,"E7A_SEXENF",null,null,"réferent","Etat civil",null,null,null,null,null,null,"Informations générales"]
[null,null,null,"Pouvez-vous indiquer où l’enfant qui participe à l’étude Elfe vit aujourd’hui ?","EFVIT","A07R_EFVIT",null,null,"donnée","dico",null,"E7A_EFVIT",null,null,"réferent","Gestion étude","Couple, famille","Etre parent",null,null,null,null,"Informations générales",null,0]
[null,null,null,"ALIMENTATION",null,null,null,null,null,null,null,null,null,null,null,null,null,null,null,null,null,null,null,null,1]
[null,null,null,"Habituellement, quel type de lait boit principalement votre enfant (y compris sous forme de lait concentré ou en poudre) ?","TYPLAIT","A07R_TYPLAIT",null,null,"donnée","dico",null,"E7A_BOISSON",null,null,"réferent","Alimentation",null,null,null,null,null,null,"Alimentation"]
[null,null,null,"Pouvez-vous préciser de quel autre type de lait il s’agit :","TYPLAITP","A07R_TYPLAITP",null,null,"donnée","text",null,"",null,null,"réferent","Alimentation",null,null,null,null,null,null,"Alimentation"]
[null,null,null,"Quelle quantité de lait votre enfant boit-il/elle par jour en moyenne ?","QTLAIT","A07R_QTLAIT",null,null,"donnée","dico",null,"E7A_QUANTITE",null,null,"réferent","Alimentation",null,null,null,null,null,null,"Alimentation"]
[null,null,null,"Combien de fois par semaine mange-t-il/elle à la cantine en période scolaire ?","MANGCANT","A07R_MANGCANT",null,null,"donnée","num",null,"",null,null,"réferent","Alimentation","Mode de garde, scolarisation",null,null,null,null,null,"Alimentation"]
[null,null,null,"Dans une semaine habituelle (en comptant le week-end), combien de petits déjeuners votre enfant prend-il/elle à votre domicile ?","NBPDEJ","A07R_NBPDEJ",null,null,"donnée","num",null,"",null,null,"réferent","Alimentation",null,null,null,null,null,null,"Alimentation"]
[null,null,null,"Dans une semaine habituelle (en comptant le week-end), combien de déjeuners votre enfant prend-il/elle à votre domicile ?","NBDEJ","A07R_NBDEJ",null,null,"donnée","num",null,"",null,null,"réferent","Alimentation",null,null,null,null,null,null,"Alimentation"]
[null,null,null,"Enfin, dans une semaine habituelle (en comptant le week-end), combien de dîners votre enfant prend-il/elle à votre domicile ?","NBDIN","A07R_NBDIN",null,null,"donnée","num",null,"",null,null,"réferent","Alimentation",null,null,null,null,null,null,"Alimentation"]
[null,null,null,"Pour chaque aliment (ou groupe d’aliments) présenté, cochez la case correspondant à la fréquence de sa consommation que ce soit AU COURS DES REPAS OU ENTRE LES REPAS : Laitages (yaourts, petits suisses, fromage blanc)","LAITAGE","A07R_LAITAGE",null,null,"donnée","dico",null,"E7A_NBFOIS",null,null,"réferent","Alimentation",null,null,null,null,null,null,"Alimentation"]
[null,null,null,"Pour chaque aliment (ou groupe d’aliments) présenté, cochez la case correspondant à la fréquence de sa consommation que ce soit AU COURS DES REPAS OU ENTRE LES REPAS : Desserts lactés (crème dessert, glace, flan…)","DESSERTLAI","A07R_DESSERTLAI",null,null,"donnée","dico",null,"E7A_NBFOIS",null,null,"réferent","Alimentation",null,null,null,null,null,null,"Alimentation"]
[null,null,null,"Pour chaque aliment (ou groupe d’aliments) présenté, cochez la case correspondant à la fréquence de sa consommation que ce soit AU COURS DES REPAS OU ENTRE LES REPAS : Fromage","FROM","A07R_FROM",null,null,"donnée","dico",null,"E7A_NBFOIS",null,null,"réferent","Alimentation",null,null,null,null,null,null,"Alimentation"]
[null,null,null,"Pour chaque aliment (ou groupe d’aliments) présenté, cochez la case correspondant à la fréquence de sa consommation que ce soit AU COURS DES REPAS OU ENTRE LES REPAS : Pâtes, riz, semoule","PATERISEM","A07R_PATERISEM",null,null,"donnée","dico",null,"E7A_NBFOIS",null,null,"réferent","Alimentation",null,null,null,null,null,null,"Alimentation"]
[null,null,null,"Pour chaque aliment (ou groupe d’aliments) présenté, cochez la case correspondant à la fréquence de sa consommation que ce soit AU COURS DES REPAS OU ENTRE LES REPAS : Pommes de terre (à l’eau ou en purée)","PDT","A07R_PDT",null,null,"donnée","dico",null,"E7A_NBFOIS",null,null,"réferent","Alimentation",null,null,null,null,null,null,"Alimentation"]
[null,null,null,"Pour chaque aliment (ou groupe d’aliments) présenté, cochez la case correspondant à la fréquence de sa consommation que ce soit AU COURS DES REPAS OU ENTRE LES REPAS : Frites, pommes de terre sautées","PDTFRIT","A07R_PDTFRIT",null,null,"donnée","dico",null,"E7A_NBFOIS",null,null,"réferent","Alimentation",null,null,null,null,null,null,"Alimentation"]
[null,null,null,"Pour chaque aliment (ou groupe d’aliments) présenté, cochez la case correspondant à la fréquence de sa consommation que ce soit AU COURS DES REPAS OU ENTRE LES REPAS : Quiches, pizzas, tartes salées","TARTESAL","A07R_TARTESAL",null,null,"donnée","dico",null,"E7A_NBFOIS",null,null,"réferent","Alimentation",null,null,null,null,null,null,"Alimentation"]
[null,null,null,"Pour chaque aliment (ou groupe d’aliments) présenté, cochez la case correspondant à la fréquence de sa consommation que ce soit AU COURS DES REPAS OU ENTRE LES REPAS : Légumes secs (lentilles, haricots blancs...)","LEGUMSEC","A07R_LEGUMSEC",null,null,"donnée","dico",null,"E7A_NBFOIS",null,null,"réferent","Alimentation",null,null,null,null,null,null,"Alimentation"]
[null,null,null,"Pour chaque aliment (ou groupe d’aliments) présenté, cochez la case correspondant à la fréquence de sa consommation que ce soit AU COURS DES REPAS OU ENTRE LES REPAS : Légumes cuits (en dehors des pommes de terre), soupes","LEGUMCUI","A07R_LEGUMCUI",null,null,"donnée","dico",null,"E7A_NBFOIS",null,null,"réferent","Alimentation",null,null,null,null,null,null,"Alimentation"]
[null,null,null,"Pour chaque aliment (ou groupe d’aliments) présenté, cochez la case correspondant à la fréquence de sa consommation que ce soit AU COURS DES REPAS OU ENTRE LES REPAS : Crudités, salade","CRUISAL","A07R_CRUISAL",null,null,"donnée","dico",null,"E7A_NBFOIS",null,null,"réferent","Alimentation",null,null,null,null,null,null,"Alimentation"]
[null,null,null,"Pour chaque aliment (ou groupe d’aliments) présenté, cochez la case correspondant à la fréquence de sa consommation que ce soit AU COURS DES REPAS OU ENTRE LES REPAS : Volaille ou jambon","VOLAJAM","A07R_VOLAJAM",null,null,"donnée","dico",null,"E7A_NBFOIS",null,null,"réferent","Alimentation",null,null,null,null,null,null,"Alimentation"]
[null,null,null,"Pour chaque aliment (ou groupe d’aliments) présenté, cochez la case correspondant à la fréquence de sa consommation que ce soit AU COURS DES REPAS OU ENTRE LES REPAS : Viande type bœuf, mouton, porc","VIAND","A07R_VIAND",null,null,"donnée","dico",null,"E7A_NBFOIS",null,null,"réferent","Alimentation",null,null,null,null,null,null,"Alimentation"]
[null,null,null,"Pour chaque aliment (ou groupe d’aliments) présenté, cochez la case correspondant à la fréquence de sa consommation que ce soit AU COURS DES REPAS OU ENTRE LES REPAS : Charcuterie (sauf jambon)","CHARCUSJ","A07R_CHARCUSJ",null,null,"donnée","dico",null,"E7A_NBFOIS",null,null,"réferent","Alimentation",null,null,null,null,null,null,"Alimentation"]
[null,null,null,"Pour chaque aliment (ou groupe d’aliments) présenté, cochez la case correspondant à la fréquence de sa consommation que ce soit AU COURS DES REPAS OU ENTRE LES REPAS : Poisson gras type maquereau, sardines, saumon, thon, hareng","POISGRA","A07R_POISGRA",null,null,"donnée","dico",null,"E7A_NBFOIS",null,null,"réferent","Alimentation",null,null,null,null,null,null,"Alimentation"]
[null,null,null,"Pour chaque aliment (ou groupe d’aliments) présenté, cochez la case correspondant à la fréquence de sa consommation que ce soit AU COURS DES REPAS OU ENTRE LES REPAS : Poisson blanc non pané type cabillaud, colin, merlan, etc.","POISFRAI","A07R_POISFRAI",null,null,"donnée","dico",null,"E7A_NBFOIS",null,null,"réferent","Alimentation",null,null,null,null,null,null,"Alimentation"]
[null,null,null,"Pour chaque aliment (ou groupe d’aliments) présenté, cochez la case correspondant à la fréquence de sa consommation que ce soit AU COURS DES REPAS OU ENTRE LES REPAS : Poisson pané","POISPANE","A07R_POISPANE",null,null,"donnée","dico",null,"E7A_NBFOIS",null,null,"réferent","Alimentation",null,null,null,null,null,null,"Alimentation"]
[null,null,null,"Pour chaque aliment (ou groupe d’aliments) présenté, cochez la case correspondant à la fréquence de sa consommation que ce soit AU COURS DES REPAS OU ENTRE LES REPAS : Œufs","OEUF","A07R_OEUF",null,null,"donnée","dico",null,"E7A_NBFOIS",null,null,"réferent","Alimentation",null,null,null,null,null,null,"Alimentation"]
[null,null,null,"Pour chaque aliment (ou groupe d’aliments) présenté, cochez la case correspondant à la fréquence de sa consommation que ce soit AU COURS DES REPAS OU ENTRE LES REPAS : Fruits frais","FRUITFRAI","A07R_FRUITFRAI",null,null,"donnée","dico",null,"E7A_NBFOIS",null,null,"réferent","Alimentation",null,null,null,null,null,null,"Alimentation"]
[null,null,null,"Pour chaque aliment (ou groupe d’aliments) présenté, cochez la case correspondant à la fréquence de sa consommation que ce soit AU COURS DES REPAS OU ENTRE LES REPAS : Compotes","COMPOT","A07R_COMPOT",null,null,"donnée","dico",null,"E7A_NBFOIS",null,null,"réferent","Alimentation",null,null,null,null,null,null,"Alimentation"]
[null,null,null,"Pour chaque aliment (ou groupe d’aliments) présenté, cochez la case correspondant à la fréquence de sa consommation que ce soit AU COURS DES REPAS OU ENTRE LES REPAS : Jus de fruits","JUSFRUIT","A07R_JUSFRUIT",null,null,"donnée","dico",null,"E7A_NBFOIS",null,null,"réferent","Alimentation",null,null,null,null,null,null,"Alimentation"]
[null,null,null,"Pour chaque aliment (ou groupe d’aliments) présenté, cochez la case correspondant à la fréquence de sa consommation que ce soit AU COURS DES REPAS OU ENTRE LES REPAS : Sodas ordinaires, sirop, autres boissons sucrées","BOISSONSUC","A07R_BOISSONSUC",null,null,"donnée","dico",null,"E7A_NBFOIS",null,null,"réferent","Alimentation",null,null,null,null,null,null,"Alimentation"]
[null,null,null,"Pour chaque aliment (ou groupe d’aliments) présenté, cochez la case correspondant à la fréquence de sa consommation que ce soit AU COURS DES REPAS OU ENTRE LES REPAS : Sodas « light »","SODALIGHT","A07R_SODALIGHT",null,null,"donnée","dico",null,"E7A_NBFOIS",null,null,"réferent","Alimentation",null,null,null,null,null,null,"Alimentation"]
[null,null,null,"Pour chaque aliment (ou groupe d’aliments) présenté, cochez la case correspondant à la fréquence de sa consommation que ce soit AU COURS DES REPAS OU ENTRE LES REPAS : Céréales de type petit-déjeuner","CEREAL","A07R_CEREAL",null,null,"donnée","dico",null,"E7A_NBFOIS",null,null,"réferent","Alimentation",null,null,null,null,null,null,"Alimentation"]
[null,null,null,"Pour chaque aliment (ou groupe d’aliments) présenté, cochez la case correspondant à la fréquence de sa consommation que ce soit AU COURS DES REPAS OU ENTRE LES REPAS : Pain blanc","PAIN7B","A07R_PAIN7B",null,null,"donnée","dico",null,"E7A_NBFOIS",null,null,"réferent","Alimentation",null,null,null,null,null,null,"Alimentation"]
[null,null,null,"Pour chaque aliment (ou groupe d’aliments) présenté, cochez la case correspondant à la fréquence de sa consommation que ce soit AU COURS DES REPAS OU ENTRE LES REPAS : Autre pain (complet, aux céréales…)","PAIN7AUT","A07R_PAIN7AUT",null,null,"donnée","dico",null,"E7A_NBFOIS",null,null,"réferent","Alimentation",null,null,null,null,null,null,"Alimentation"]
[null,null,null,"Pour chaque aliment (ou groupe d’aliments) présenté, cochez la case correspondant à la fréquence de sa consommation que ce soit AU COURS DES REPAS OU ENTRE LES REPAS : Viennoiseries, biscuits, gâteaux, pâtisseries","VIENBISGAT","A07R_VIENBISGAT",null,null,"donnée","dico",null,"E7A_NBFOIS",null,null,"réferent","Alimentation",null,null,null,null,null,null,"Alimentation"]
[null,null,null,"Pour chaque aliment (ou groupe d’aliments) présenté, cochez la case correspondant à la fréquence de sa consommation que ce soit AU COURS DES REPAS OU ENTRE LES REPAS : Bonbons, chocolat","BONCHOC","A07R_BONCHOC",null,null,"donnée","dico",null,"E7A_NBFOIS",null,null,"réferent","Alimentation",null,null,null,null,null,null,"Alimentation"]
[null,null,null,"Pour chaque aliment (ou groupe d’aliments) présenté, cochez la case correspondant à la fréquence de sa consommation que ce soit AU COURS DES REPAS OU ENTRE LES REPAS : Chips, biscuits apéritifs","BISCAPERO","A07R_BISCAPERO",null,null,"donnée","dico",null,"E7A_NBFOIS",null,null,"réferent","Alimentation",null,null,null,null,null,null,"Alimentation"]
[null,null,null,"Pour chaque aliment (ou groupe d’aliments) présenté, cochez la case correspondant à la fréquence de sa consommation que ce soit AU COURS DES REPAS OU ENTRE LES REPAS : Eau du robinet","EAUROB","A07R_EAUROB",null,null,"donnée","dico",null,"E7A_NBFOIS",null,null,"réferent","Alimentation",null,null,null,null,null,null,"Alimentation"]
[null,null,null,"Pour chaque aliment (ou groupe d’aliments) présenté, cochez la case correspondant à la fréquence de sa consommation que ce soit AU COURS DES REPAS OU ENTRE LES REPAS : Eau en bouteille ou bonbonne (minérale ou de source)","EAUBOUT","A07R_EAUBOUT",null,null,"donnée","dico",null,"E7A_NBFOIS",null,null,"réferent","Alimentation",null,null,null,null,null,null,"Alimentation"]
[null,null,null,"Le plus souvent, quelle matière grasse utilisez-vous pour : La cuisson des viandes","MGVIAND","A07R_MGVIAND",null,null,"donnée","dico",null,"E7A_MATGRASS",null,null,"réferent","Alimentation",null,null,null,null,null,null,"Alimentation"]
[null,null,null,"Le plus souvent, quelle matière grasse utilisez-vous pour : La cuisson des poissons","MGPOISSON","A07R_MGPOISSON",null,null,"donnée","dico",null,"E7A_MATGRASS",null,null,"réferent","Alimentation",null,null,null,null,null,null,"Alimentation"]
[null,null,null,"Le plus souvent, quelle matière grasse utilisez-vous pour : La cuisson des frites","MGFRITES","A07R_MGFRITES",null,null,"donnée","dico",null,"E7A_MATGRASS",null,null,"réferent","Alimentation",null,null,null,null,null,null,"Alimentation"]
[null,null,null,"Le plus souvent, quelle matière grasse utilisez-vous pour : L’assaisonnement des crudités","MGCRUDIT","A07R_MGCRUDIT",null,null,"donnée","dico",null,"E7A_MATGRASS",null,null,"réferent","Alimentation",null,null,null,null,null,null,"Alimentation"]
[null,null,null,"Le plus souvent, quelle matière grasse utilisez-vous pour : La cuisson des légumes","MGLEGUM","A07R_MGLEGUM",null,null,"donnée","dico",null,"E7A_MATGRASS",null,null,"réferent","Alimentation",null,null,null,null,null,null,"Alimentation"]
[null,null,null,"Le plus souvent, quelle matière grasse utilisez-vous pour : L’assaisonnement des féculents après cuisson","MGFECUL","A07R_MGFECUL",null,null,"donnée","dico",null,"E7A_MATGRASS",null,null,"réferent","Alimentation",null,null,null,null,null,null,"Alimentation"]
[null,null,null,"Donnez-vous à votre enfant des aliments issus de l’agriculture biologique ?","BIOENF","A07R_BIOENF",null,null,"donnée","dico",null,"E7A_YORN",null,null,"réferent","Alimentation","Expositions chimiques",null,null,null,null,null,"Alimentation"]
[null,null,null,"Pouvez-vous indiquer quel type d’aliment bio vous lui donnez et à quelle fréquence ? Du sucre bio","BIOSUC","A07R_BIOSUC",null,null,"donnée","dico",null,"E7A_FREQSEM",null,null,"réferent","Alimentation","Expositions chimiques",null,null,null,null,null,"Alimentation"]
[null,null,null,"Pouvez-vous indiquer quel type d’aliment bio vous lui donnez et à quelle fréquence ? Des fruits bio","BIOFRUI","A07R_BIOFRUI",null,null,"donnée","dico",null,"E7A_FREQSEM",null,null,"réferent","Alimentation","Expositions chimiques",null,null,null,null,null,"Alimentation"]
[null,null,null,"Pouvez-vous indiquer quel type d’aliment bio vous lui donnez et à quelle fréquence ? Des légumes bio","BIOLEG","A07R_BIOLEG",null,null,"donnée","dico",null,"E7A_FREQSEM",null,null,"réferent","Alimentation","Expositions chimiques",null,null,null,null,null,"Alimentation"]
[null,null,null,"Pouvez-vous indiquer quel type d’aliment bio vous lui donnez et à quelle fréquence ? Du pain bio","BIOPAIN","A07R_BIOPAIN",null,null,"donnée","dico",null,"E7A_FREQSEM",null,null,"réferent","Alimentation","Expositions chimiques",null,null,null,null,null,"Alimentation"]
[null,null,null,"Pouvez-vous indiquer quel type d’aliment bio vous lui donnez et à quelle fréquence ? Des céréales bio (pâtes, riz, blé…)","BIOCER","A07R_BIOCER",null,null,"donnée","dico",null,"E7A_FREQSEM",null,null,"réferent","Alimentation","Expositions chimiques",null,null,null,null,null,"Alimentation"]
[null,null,null,"Pouvez-vous indiquer quel type d’aliment bio vous lui donnez et à quelle fréquence ? Des produits laitiers bio (lait, beurre, crème fraîche, fromage)","BIOLAIT","A07R_BIOLAIT",null,null,"donnée","dico",null,"E7A_FREQSEM",null,null,"réferent","Alimentation","Expositions chimiques",null,null,null,null,null,"Alimentation"]
[null,null,null,"Pouvez-vous indiquer quel type d’aliment bio vous lui donnez et à quelle fréquence ? Des œufs bio","BIOEUF","A07R_BIOEUF",null,null,"donnée","dico",null,"E7A_FREQSEM",null,null,"réferent","Alimentation","Expositions chimiques",null,null,null,null,null,"Alimentation"]
[null,null,null,"Pouvez-vous indiquer quel type d’aliment bio vous lui donnez et à quelle fréquence ? De la viande bio","BIOVIAND","A07R_BIOVIAND",null,null,"donnée","dico",null,"E7A_FREQSEM",null,null,"réferent","Alimentation","Expositions chimiques",null,null,null,null,null,"Alimentation"]
[null,null,null,"Pouvez-vous indiquer quel type d’aliment bio vous lui donnez et à quelle fréquence ? Du poisson bio","BIOPOISS","A07R_BIOPOISS",null,null,"donnée","dico",null,"E7A_FREQSEM",null,null,"réferent","Alimentation","Expositions chimiques",null,null,null,null,null,"Alimentation"]
[null,null,null,"Pouvez-vous indiquer quel type d’aliment bio vous lui donnez et à quelle fréquence ? Des biscuits, du chocolat bio","BIOBISCH","A07R_BIOBISCH",null,null,"donnée","dico",null,"E7A_FREQSEM",null,null,"réferent","Alimentation","Expositions chimiques",null,null,null,null,null,"Alimentation"]
[null,null,null,"Pouvez-vous indiquer quel type d’aliment bio vous lui donnez et à quelle fréquence ? Des fruits secs bio","BIOFRUISEC","A07R_BIOFRUISEC",null,null,"donnée","dico",null,"E7A_FREQSEM",null,null,"réferent","Alimentation","Expositions chimiques",null,null,null,null,null,"Alimentation"]
[null,null,null,"Utilisez-vous un four à micro-ondes chez vous ?","MICROO","A07R_MICROO",null,null,"donnée","dico",null,"E7A_YORN",null,null,"réferent","Alimentation","Expositions chimiques",null,null,null,null,null,"Alimentation"]
[null,null,null,"Lorsque vous utilisez le four à micro-ondes pour chauffer ou réchauffer des aliments pour votre enfant, utilisez-vous ? Un contenant en plastique (type « Tupperware »)","MICROTUP","A07R_MICROTUP",null,null,"donnée","dico",null,"E7A_FREQSEM",null,null,"réferent","Alimentation","Expositions chimiques",null,null,null,null,null,"Alimentation"]
[null,null,null,"Lorsque vous utilisez le four à micro-ondes pour chauffer ou réchauffer des aliments pour votre enfant, utilisez-vous ? L’emballage d’origine (pour les plats préparés)","MICROEMB","A07R_MICROEMB",null,null,"donnée","dico",null,"E7A_FREQSEM",null,null,"réferent","Alimentation","Expositions chimiques",null,null,null,null,null,"Alimentation"]
[null,null,null,"Lorsque vous utilisez le four à micro-ondes pour chauffer ou réchauffer des aliments pour votre enfant, utilisez-vous ? Un contenant en verre, céramique, terre cuite ou porcelaine","MICROVER","A07R_MICROVER",null,null,"donnée","dico",null,"E7A_FREQSEM",null,null,"réferent","Alimentation","Expositions chimiques",null,null,null,null,null,"Alimentation"]
[null,null,null,"Lorsque vous utilisez le four à micro-ondes pour chauffer ou réchauffer des aliments pour votre enfant, utilisez-vous ? Autre","MICROAUT","A07R_MICROAUT",null,null,"donnée","dico",null,"E7A_FREQSEM",null,null,"réferent","Alimentation","Expositions chimiques",null,null,null,null,null,"Alimentation"]
[null,null,null,"Pouvez-vous préciser de quel autre contenant il s’agit :","MICROAUTP","A07R_MICROAUTP",null,null,"donnée","text",null,"",null,null,"réferent","Alimentation","Expositions chimiques",null,null,null,null,null,"Alimentation"]
[null,null,null,"Pour chacune des affirmations suivantes, veuillez cocher la case qui correspond le mieux au comportement de votre enfant. Mon enfant aime beaucoup manger","CEBQ1","A07R_CEBQ1",null,null,"donnée","dico",null,"E7A_FREQHAB",null,null,"réferent","Alimentation","Santé mentale",null,null,null,null,null,"Alimentation","CEBQ"]
[null,null,null,"Pour chacune des affirmations suivantes, veuillez cocher la case qui correspond le mieux au comportement de votre enfant. Mange davantage quand il/elle s’inquiète","CEBQ2","A07R_CEBQ2",null,null,"donnée","dico",null,"E7A_FREQHAB",null,null,"réferent","Alimentation","Santé mentale",null,null,null,null,null,"Alimentation","CEBQ"]
[null,null,null,"Pour chacune des affirmations suivantes, veuillez cocher la case qui correspond le mieux au comportement de votre enfant. A bon appétit","CEBQ3","A07R_CEBQ3",null,null,"donnée","dico",null,"E7A_FREQHAB",null,null,"réferent","Alimentation","Santé mentale",null,null,null,null,null,"Alimentation","CEBQ"]
[null,null,null,"Pour chacune des affirmations suivantes, veuillez cocher la case qui correspond le mieux au comportement de votre enfant. Termine ses repas rapidement","CEBQ4","A07R_CEBQ4",null,null,"donnée","dico",null,"E7A_FREQHAB",null,null,"réferent","Alimentation","Santé mentale",null,null,null,null,null,"Alimentation","CEBQ"]
[null,null,null,"Pour chacune des affirmations suivantes, veuillez cocher la case qui correspond le mieux au comportement de votre enfant. Apprécie la nourriture","CEBQ5","A07R_CEBQ5",null,null,"donnée","dico",null,"E7A_FREQHAB",null,null,"réferent","Alimentation","Santé mentale",null,null,null,null,null,"Alimentation","CEBQ"]
[null,null,null,"Pour chacune des affirmations suivantes, veuillez cocher la case qui correspond le mieux au comportement de votre enfant. La première réaction de mon enfant est de refuser de goûter à tout aliment inconnu","CEBQ6","A07R_CEBQ6",null,null,"donnée","dico",null,"E7A_FREQHAB",null,null,"réferent","Alimentation","Santé mentale",null,null,null,null,null,"Alimentation","CEBQ"]
[null,null,null,"Pour chacune des affirmations suivantes, veuillez cocher la case qui correspond le mieux au comportement de votre enfant. Mon enfant mange lentement","CEBQ7","A07R_CEBQ7",null,null,"donnée","dico",null,"E7A_FREQHAB",null,null,"réferent","Alimentation","Santé mentale",null,null,null,null,null,"Alimentation","CEBQ"]
[null,null,null,"Pour chacune des affirmations suivantes, veuillez cocher la case qui correspond le mieux au comportement de votre enfant. Mange moins quand il/elle est fâché(e)","CEBQ8","A07R_CEBQ8",null,null,"donnée","dico",null,"E7A_FREQHAB",null,null,"réferent","Alimentation","Santé mentale",null,null,null,null,null,"Alimentation","CEBQ"]
[null,null,null,"Pour chacune des affirmations suivantes, veuillez cocher la case qui correspond le mieux au comportement de votre enfant. Aime goûter à de nouveaux aliments","CEBQ9","A07R_CEBQ9",null,null,"donnée","dico",null,"E7A_FREQHAB",null,null,"réferent","Alimentation","Santé mentale",null,null,null,null,null,"Alimentation","CEBQ"]
[null,null,null,"Pour chacune des affirmations suivantes, veuillez cocher la case qui correspond le mieux au comportement de votre enfant. Mange moins quand il/elle est fatigué(e)","CEBQ10","A07R_CEBQ10",null,null,"donnée","dico",null,"E7A_FREQHAB",null,null,"réferent","Alimentation","Santé mentale",null,null,null,null,null,"Alimentation","CEBQ"]
[null,null,null,"Pour chacune des affirmations suivantes, veuillez cocher la case qui correspond le mieux au comportement de votre enfant. Demande toujours à manger","CEBQ11","A07R_CEBQ11",null,null,"donnée","dico",null,"E7A_FREQHAB",null,null,"réferent","Alimentation","Santé mentale",null,null,null,null,null,"Alimentation","CEBQ"]
[null,null,null,"Pour chacune des affirmations suivantes, veuillez cocher la case qui correspond le mieux au comportement de votre enfant. Mange davantage quand il/elle s’ennuie","CEBQ12","A07R_CEBQ12",null,null,"donnée","dico",null,"E7A_FREQHAB",null,null,"réferent","Alimentation","Santé mentale",null,null,null,null,null,"Alimentation","CEBQ"]
[null,null,null,"Pour chacune des affirmations suivantes, veuillez cocher la case qui correspond le mieux au comportement de votre enfant. Mon enfant mangerait trop si je le lui permettais","CEBQ13","A07R_CEBQ13",null,null,"donnée","dico",null,"E7A_FREQHAB",null,null,"réferent","Alimentation","Santé mentale",null,null,null,null,null,"Alimentation","CEBQ"]
[null,null,null,"Pour chacune des affirmations suivantes, veuillez cocher la case qui correspond le mieux au comportement de votre enfant. Mange davantage quand il/elle est anxieux(se)","CEBQ14","A07R_CEBQ14",null,null,"donnée","dico",null,"E7A_FREQHAB",null,null,"réferent","Alimentation","Santé mentale",null,null,null,null,null,"Alimentation","CEBQ"]
[null,null,null,"Pour chacune des affirmations suivantes, veuillez cocher la case qui correspond le mieux au comportement de votre enfant. Aime bien manger des aliments très variés","CEBQ15","A07R_CEBQ15",null,null,"donnée","dico",null,"E7A_FREQHAB",null,null,"réferent","Alimentation","Santé mentale",null,null,null,null,null,"Alimentation","CEBQ"]
[null,null,null,"Pour chacune des affirmations suivantes, veuillez cocher la case qui correspond le mieux au comportement de votre enfant. Laisse toujours de la nourriture dans son assiette à la fin du repas","CEBQ16","A07R_CEBQ16",null,null,"donnée","dico",null,"E7A_FREQHAB",null,null,"réferent","Alimentation","Santé mentale",null,null,null,null,null,"Alimentation","CEBQ"]
[null,null,null,"Pour chacune des affirmations suivantes, veuillez cocher la case qui correspond le mieux au comportement de votre enfant. Prend plus de 30 minutes pour finir son repas","CEBQ17","A07R_CEBQ17",null,null,"donnée","dico",null,"E7A_FREQHAB",null,null,"réferent","Alimentation","Santé mentale",null,null,null,null,null,"Alimentation","CEBQ"]
[null,null,null,"Pour chacune des affirmations suivantes, veuillez cocher la case qui correspond le mieux au comportement de votre enfant. Mangerait presque tout le temps s’il/elle avait le choix","CEBQ18","A07R_CEBQ18",null,null,"donnée","dico",null,"E7A_FREQHAB",null,null,"réferent","Alimentation","Santé mentale",null,null,null,null,null,"Alimentation","CEBQ"]
[null,null,null,"Pour chacune des affirmations suivantes, veuillez cocher la case qui correspond le mieux au comportement de votre enfant. Attend l’heure du repas avec impatience","CEBQ19","A07R_CEBQ19",null,null,"donnée","dico",null,"E7A_FREQHAB",null,null,"réferent","Alimentation","Santé mentale",null,null,null,null,null,"Alimentation","CEBQ"]
[null,null,null,"Pour chacune des affirmations suivantes, veuillez cocher la case qui correspond le mieux au comportement de votre enfant. Est rassasié(e) avant la fin du repas","CEBQ20","A07R_CEBQ20",null,null,"donnée","dico",null,"E7A_FREQHAB",null,null,"réferent","Alimentation","Santé mentale",null,null,null,null,null,"Alimentation","CEBQ"]
[null,null,null,"Pour chacune des affirmations suivantes, veuillez cocher la case qui correspond le mieux au comportement de votre enfant. Prend plaisir à manger","CEBQ21","A07R_CEBQ21",null,null,"donnée","dico",null,"E7A_FREQHAB",null,null,"réferent","Alimentation","Santé mentale",null,null,null,null,null,"Alimentation","CEBQ"]
[null,null,null,"Pour chacune des affirmations suivantes, veuillez cocher la case qui correspond le mieux au comportement de votre enfant. Mange davantage quand il/elle est content(e)","CEBQ22","A07R_CEBQ22",null,null,"donnée","dico",null,"E7A_FREQHAB",null,null,"réferent","Alimentation","Santé mentale",null,null,null,null,null,"Alimentation","CEBQ"]
[null,null,null,"Pour chacune des affirmations suivantes, veuillez cocher la case qui correspond le mieux au comportement de votre enfant. Il est difficile de trouver un menu qui plaise à mon enfant","CEBQ23","A07R_CEBQ23",null,null,"donnée","dico",null,"E7A_FREQHAB",null,null,"réferent","Alimentation","Santé mentale",null,null,null,null,null,"Alimentation","CEBQ"]
[null,null,null,"Pour chacune des affirmations suivantes, veuillez cocher la case qui correspond le mieux au comportement de votre enfant. Mon enfant mange moins quand il/elle est contrarié(e)","CEBQ24","A07R_CEBQ24",null,null,"donnée","dico",null,"E7A_FREQHAB",null,null,"réferent","Alimentation","Santé mentale",null,null,null,null,null,"Alimentation","CEBQ"]
[null,null,null,"Pour chacune des affirmations suivantes, veuillez cocher la case qui correspond le mieux au comportement de votre enfant. Est rassasié(e) facilement","CEBQ25","A07R_CEBQ25",null,null,"donnée","dico",null,"E7A_FREQHAB",null,null,"réferent","Alimentation","Santé mentale",null,null,null,null,null,"Alimentation","CEBQ"]
[null,null,null,"Pour chacune des affirmations suivantes, veuillez cocher la case qui correspond le mieux au comportement de votre enfant. Mange davantage quand il/elle n’a rien d’autre à faire","CEBQ26","A07R_CEBQ26",null,null,"donnée","dico",null,"E7A_FREQHAB",null,null,"réferent","Alimentation","Santé mentale",null,null,null,null,null,"Alimentation","CEBQ"]
[null,null,null,"Pour chacune des affirmations suivantes, veuillez cocher la case qui correspond le mieux au comportement de votre enfant. Trouve toujours de la place pour manger sa nourriture préférée même lorsqu’il/elle est rassasié(e)","CEBQ27","A07R_CEBQ27",null,null,"donnée","dico",null,"E7A_FREQHAB",null,null,"réferent","Alimentation","Santé mentale",null,null,null,null,null,"Alimentation","CEBQ"]
[null,null,null,"Pour chacune des affirmations suivantes, veuillez cocher la case qui correspond le mieux au comportement de votre enfant. Mon enfant ne peut pas manger son repas juste après avoir mangé un snack","CEBQ28","A07R_CEBQ28",null,null,"donnée","dico",null,"E7A_FREQHAB",null,null,"réferent","Alimentation","Santé mentale",null,null,null,null,null,"Alimentation","CEBQ"]
[null,null,null,"Pour chacune des affirmations suivantes, veuillez cocher la case qui correspond le mieux au comportement de votre enfant. Aime goûter à des aliments auxquels il/elle n’a jamais goûté avant","CEBQ29","A07R_CEBQ29",null,null,"donnée","dico",null,"E7A_FREQHAB",null,null,"réferent","Alimentation","Santé mentale",null,null,null,null,null,"Alimentation","CEBQ"]
[null,null,null,"Pour chacune des affirmations suivantes, veuillez cocher la case qui correspond le mieux au comportement de votre enfant. Décide qu’il/elle n’aime pas un aliment, avant même d’y avoir goûté","CEBQ30","A07R_CEBQ30",null,null,"donnée","dico",null,"E7A_FREQHAB",null,null,"réferent","Alimentation","Santé mentale",null,null,null,null,null,"Alimentation","CEBQ"]
[null,null,null,"Pour chacune des affirmations suivantes, veuillez cocher la case qui correspond le mieux au comportement de votre enfant. Serait toujours en train de manger si on le/la laissait faire","CEBQ31","A07R_CEBQ31",null,null,"donnée","dico",null,"E7A_FREQHAB",null,null,"réferent","Alimentation","Santé mentale",null,null,null,null,null,"Alimentation","CEBQ"]
[null,null,null,"Pour chacune des affirmations suivantes, veuillez cocher la case qui correspond le mieux au comportement de votre enfant. Mange de plus en plus lentement tout au long du repas","CEBQ32","A07R_CEBQ32",null,null,"donnée","dico",null,"E7A_FREQHAB",null,null,"réferent","Alimentation","Santé mentale",null,null,null,null,null,"Alimentation","CEBQ"]
[null,null,null,"Sensibilité à l'alimentation","CEBQ_FR","A07R_CEBQ_FR",null,null,"donnée","num",null,"",null,null,"réferent","Alimentation","Santé mentale",null,null,null,null,null,"Alimentation","CEBQ"]
[null,null,null,"Surconsommation émotionnelle","CEBQ_EOE","A07R_CEBQ_EOE",null,null,"donnée","num",null,"",null,null,"réferent","Alimentation","Santé mentale",null,null,null,null,null,"Alimentation","CEBQ"]
[null,null,null,"Appréciation de l’alimentation","CEBQ_EF","A07R_CEBQ_EF",null,null,"donnée","num",null,"",null,null,"réferent","Alimentation","Santé mentale",null,null,null,null,null,"Alimentation","CEBQ"]
[null,null,null,"Sensibilité à la satiété","CEBQ_SR","A07R_CEBQ_SR",null,null,"donnée","num",null,"",null,null,"réferent","Alimentation","Santé mentale",null,null,null,null,null,"Alimentation","CEBQ"]
[null,null,null,"Lenteur à s’alimenter","CEBQ_SE","A07R_CEBQ_SE",null,null,"donnée","num",null,"",null,null,"réferent","Alimentation","Santé mentale",null,null,null,null,null,"Alimentation","CEBQ"]
[null,null,null,"Sous-consommation émotionnelle","CEBQ_EUE","A07R_CEBQ_EUE",null,null,"donnée","num",null,"",null,null,"réferent","Alimentation","Santé mentale",null,null,null,null,null,"Alimentation","CEBQ"]
[null,null,null,"Néophobie alimentaire","CEBQ_FF","A07R_CEBQ_FF",null,null,"donnée","num",null,"",null,null,"réferent","Alimentation","Santé mentale",null,null,null,null,null,"Alimentation","CEBQ",0]
[null,null,null,"DESSIN",null,null,null,null,null,null,null,null,null,null,null,null,null,null,null,null,null,null,null,null,1]
[null,null,null,"Dessin envoyé pour codage","CODDESSIN","A07R_CODDESSIN",null,null,"donnée","dico",null,"E7A_YORN",null,null,"réferent","Gestion étude",null,null,null,null,null,null,"Dessin",null,0]
[null,null,null,"VOS LOISIRS",null,null,null,null,null,null,null,null,null,null,null,null,null,null,null,null,null,null,null,null,1]
[null,null,null,"Vous personnellement pratiquez-vous une activité physique pour votre loisir (marche à pied, vélo, natation ou toute autre activité sportive encadrée ou pas) au moins une fois par semaine, en dehors des vacances ?","PARSPORT","A07R_PARSPORT",null,null,"donnée","dico",null,"E7A_YORN",null,null,"réferent","Mode de vie, voisinage","Santé autres",null,null,null,null,null,"Vos loisirs"]
[null,null,null,"Combien de temps en moyenne par semaine consacrez-vous à cette/ces activité(s) ?","PARSPORTPS","A07R_PARSPORTPS",null,null,"donnée","dico",null,"E7A_DUREE",null,null,"réferent","Mode de vie, voisinage","Santé autres",null,null,null,null,null,"Vos loisirs"]
[null,null,null,"Votre conjoint(e) pratique-t-il/elle une activité physique pour son loisir au moins une fois par semaine, en dehors des vacances ?","PARSPORTAUT","A07R_PARSPORTAUT",null,null,"donnée","dico",null,"E7A_YORN_NC",null,null,"réferent","Mode de vie, voisinage","Santé autres",null,null,null,null,null,"Vos loisirs"]
[null,null,null,"Combien de temps en moyenne par semaine votre conjoint(e) consacre-t-il/elle à cette/ces activité(s) ?","PARSPORTPSAUT","A07R_PARSPORTPSAUT",null,null,"donnée","dico",null,"E7A_DUREE_NSP",null,null,"réferent","Mode de vie, voisinage","Santé autres",null,null,null,null,null,"Vos loisirs"]
[null,null,null,"Combien de temps votre enfant passe-t-il/elle à faire des activités physiques avec vous ? Avec vous uniquement","PARENFSPORTPS1","A07R_PARENFSPORTPS1",null,null,"donnée","dico",null,"E7A_FREQANN",null,null,"réferent","Mode de vie, voisinage","Activités quotidiennes de l'enfant","Etre parent",null,null,null,null,"Vos loisirs"]
[null,null,null,"Combien de temps votre enfant passe-t-il/elle à faire des activités physiques avec vous et/ou votre conjoint(e) ? Uniquement avec votre conjoint(e)","PARENFSPORTPS2","A07R_PARENFSPORTPS2",null,null,"donnée","dico",null,"E7A_FREQANN_NC",null,null,"réferent","Mode de vie, voisinage","Activités quotidiennes de l'enfant","Etre parent",null,null,null,null,"Vos loisirs"]
[null,null,null,"Combien de temps votre enfant passe-t-il/elle à faire des activités physiques avec vous et/ou votre conjoint(e) ? Avec vous et votre conjoint(e) ensemble","PARENFSPORTPS3","A07R_PARENFSPORTPS3",null,null,"donnée","dico",null,"E7A_FREQANN_NC",null,null,"réferent","Mode de vie, voisinage","Activités quotidiennes de l'enfant","Etre parent",null,null,null,null,"Vos loisirs"]
[null,null,null,"De quel(s) type(s) d’activité s’agit-il ? Marche ou course à pied","PARENFACT1","A07R_PARENFACT1",null,null,"donnée","dico",null,"E7A_YORN",null,null,"réferent","Mode de vie, voisinage","Activités quotidiennes de l'enfant",null,null,null,null,null,"Vos loisirs"]
[null,null,null,"De quel(s) type(s) d’activité s’agit-il ? Jeux de ballon","PARENFACT2","A07R_PARENFACT2",null,null,"donnée","dico",null,"E7A_YORN",null,null,"réferent","Mode de vie, voisinage","Activités quotidiennes de l'enfant",null,null,null,null,null,"Vos loisirs"]
[null,null,null,"De quel(s) type(s) d’activité s’agit-il ? Vélo","PARENFACT3","A07R_PARENFACT3",null,null,"donnée","dico",null,"E7A_YORN",null,null,"réferent","Mode de vie, voisinage","Activités quotidiennes de l'enfant",null,null,null,null,null,"Vos loisirs"]
[null,null,null,"De quel(s) type(s) d’activité s’agit-il ? Piscine","PARENFACT4","A07R_PARENFACT4",null,null,"donnée","dico",null,"E7A_YORN",null,null,"réferent","Mode de vie, voisinage","Activités quotidiennes de l'enfant",null,null,null,null,null,"Vos loisirs"]
[null,null,null,"De quel(s) type(s) d’activité s’agit-il ? Jeux de raquettes (tennis, badminton, etc.)","PARENFACT5","A07R_PARENFACT5",null,null,"donnée","dico",null,"E7A_YORN",null,null,"réferent","Mode de vie, voisinage","Activités quotidiennes de l'enfant",null,null,null,null,null,"Vos loisirs"]
[null,null,null,"De quel(s) type(s) d’activité s’agit-il ? Poney, équitation","PARENFACT6","A07R_PARENFACT6",null,null,"donnée","dico",null,"E7A_YORN",null,null,"réferent","Mode de vie, voisinage","Activités quotidiennes de l'enfant",null,null,null,null,null,"Vos loisirs"]
[null,null,null,"De quel(s) type(s) d’activité s’agit-il ? Sports de glisse sur eau (voile, canoë, surf, etc.)","PARENFACT7","A07R_PARENFACT7",null,null,"donnée","dico",null,"E7A_YORN",null,null,"réferent","Mode de vie, voisinage","Activités quotidiennes de l'enfant",null,null,null,null,null,"Vos loisirs"]
[null,null,null,"De quel(s) type(s) d’activité s’agit-il ? Sports d’hiver (ski, snowboard, luge, etc.)","PARENFACT8","A07R_PARENFACT8",null,null,"donnée","dico",null,"E7A_YORN",null,null,"réferent","Mode de vie, voisinage","Activités quotidiennes de l'enfant",null,null,null,null,null,"Vos loisirs"]
[null,null,null,"De quel(s) type(s) d’activité s’agit-il ? Escalade","PARENFACT9","A07R_PARENFACT9",null,null,"donnée","dico",null,"E7A_YORN",null,null,"réferent","Mode de vie, voisinage","Activités quotidiennes de l'enfant",null,null,null,null,null,"Vos loisirs"]
[null,null,null,"De quel(s) type(s) d’activité s’agit-il ? Autre(s)","PARENFACT10","A07R_PARENFACT10",null,null,"donnée","dico",null,"E7A_YORN",null,null,"réferent","Mode de vie, voisinage","Activités quotidiennes de l'enfant",null,null,null,null,null,"Vos loisirs"]
[null,null,null,"Préciser de quelle autre activité il s’agit :","PARENFACT10P1","A07R_PARENFACT10P1",null,null,"donnée","text",null,"",null,null,"réferent","Mode de vie, voisinage","Activités quotidiennes de l'enfant",null,null,null,null,null,"Vos loisirs"]
[null,null,null,"Y a-t-il une autre activité ?","PARENFACT10P2","A07R_PARENFACT10P2",null,null,"donnée","dico",null,"E7A_YORN",null,null,"réferent","Mode de vie, voisinage","Activités quotidiennes de l'enfant",null,null,null,null,null,"Vos loisirs"]
[null,null,null,"Préciser de quelle autre activité il s’agit :","PARENFACT10P2P","A07R_PARENFACT10P2P",null,null,"donnée","text",null,"",null,null,"réferent","Mode de vie, voisinage","Activités quotidiennes de l'enfant",null,null,null,null,null,"Vos loisirs"]
[null,null,null,"Au cours des 12 DERNIERS MOIS, que ce soit AVEC ou SANS votre enfant, vous est-il arrivé de : aller au cinéma","CINE","A07R_CINE",null,null,"donnée","dico",null,"E7A_YORN",null,null,"réferent","Mode de vie, voisinage",null,null,null,null,null,null,"Vos loisirs"]
[null,null,null,"Au cours des 12 DERNIERS MOIS, que ce soit AVEC ou SANS votre enfant, vous est-il arrivé de : aller voir un match, une compétition sportive","MATCH","A07R_MATCH",null,null,"donnée","dico",null,"E7A_YORN",null,null,"réferent","Mode de vie, voisinage",null,null,null,null,null,null,"Vos loisirs"]
[null,null,null,"Au cours des 12 DERNIERS MOIS, que ce soit AVEC ou SANS votre enfant, vous est-il arrivé de : aller en boîte de nuit, en discothèque","DISCO","A07R_DISCO",null,null,"donnée","dico",null,"E7A_YORN",null,null,"réferent","Mode de vie, voisinage",null,null,null,null,null,null,"Vos loisirs"]
[null,null,null,"Au cours des 12 DERNIERS MOIS, que ce soit AVEC ou SANS votre enfant, vous est-il arrivé de : aller à un concert","CONC","A07R_CONC",null,null,"donnée","dico",null,"E7A_YORN",null,null,"réferent","Mode de vie, voisinage",null,null,null,null,null,null,"Vos loisirs"]
[null,null,null,"Au cours des 12 DERNIERS MOIS, que ce soit AVEC ou SANS votre enfant, vous est-il arrivé de : aller voir un spectacle (danse, théâtre)","SPEC","A07R_SPEC",null,null,"donnée","dico",null,"E7A_YORN",null,null,"réferent","Mode de vie, voisinage",null,null,null,null,null,null,"Vos loisirs"]
[null,null,null,"Au cours des 12 DERNIERS MOIS, que ce soit AVEC ou SANS votre enfant, vous est-il arrivé de : aller dans une bibliothèque, une médiathèque","BIBL","A07R_BIBL",null,null,"donnée","dico",null,"E7A_YORN",null,null,"réferent","Mode de vie, voisinage",null,null,null,null,null,null,"Vos loisirs"]
[null,null,null,"Au cours des 12 DERNIERS MOIS, que ce soit AVEC ou SANS votre enfant, vous est-il arrivé de : aller dans un musée, voir une exposition, visiter un monument historique","MUSEE","A07R_MUSEE",null,null,"donnée","dico",null,"E7A_YORN",null,null,"réferent","Mode de vie, voisinage",null,null,null,null,null,null,"Vos loisirs"]
[null,null,null,"Et toujours au cours des 12 DERNIERS MOIS, que ce soit AVEC ou SANS votre enfant, vous est-il arrivé de : bricoler, jardiner","BRICO","A07R_BRICO",null,null,"donnée","dico",null,"E7A_FREQFOIS",null,null,"réferent","Mode de vie, voisinage",null,null,null,null,null,null,"Vos loisirs"]
[null,null,null,"Et toujours au cours des 12 DERNIERS MOIS, que ce soit AVEC ou SANS votre enfant, vous est-il arrivé de : broder, tricoter, coudre","BROD","A07R_BROD",null,null,"donnée","dico",null,"E7A_FREQFOIS",null,null,"réferent","Mode de vie, voisinage",null,null,null,null,null,null,"Vos loisirs"]
[null,null,null,"Et toujours au cours des 12 DERNIERS MOIS, que ce soit AVEC ou SANS votre enfant, vous est-il arrivé de : dessiner, chanter, danser, jouer d’un instrument de musique","DESSIN","A07R_DESSIN",null,null,"donnée","dico",null,"E7A_FREQFOIS",null,null,"réferent","Mode de vie, voisinage",null,null,null,null,null,null,"Vos loisirs"]
[null,null,null,"Et toujours au cours des 12 DERNIERS MOIS, que ce soit AVEC ou SANS votre enfant, vous est-il arrivé de : aller à la chasse ou à la pêche","CHASSE","A07R_CHASSE",null,null,"donnée","dico",null,"E7A_FREQFOIS",null,null,"réferent","Mode de vie, voisinage",null,null,null,null,null,null,"Vos loisirs"]
[null,null,null,"Et toujours au cours des 12 DERNIERS MOIS, que ce soit AVEC ou SANS votre enfant, vous est-il arrivé de : regarder des émissions ou des programmes de télévision (y compris sur internet et programmes ou émissions enregistrés)","MOMTV","A07R_MOMTV",null,null,"donnée","dico",null,"E7A_FREQFOIS",null,null,"réferent","Mode de vie, voisinage",null,null,null,null,null,null,"Vos loisirs"]
[null,null,null,"Et toujours au cours des 12 DERNIERS MOIS, que ce soit AVEC ou SANS votre enfant, vous est-il arrivé de : utiliser un ordinateur, une tablette ou un Smartphone pour vos loisirs","MOMORDI","A07R_MOMORDI",null,null,"donnée","dico",null,"E7A_FREQFOIS",null,null,"réferent","Mode de vie, voisinage",null,null,null,null,null,null,"Vos loisirs"]
[null,null,null,"Et toujours au cours des 12 DERNIERS MOIS, que ce soit AVEC ou SANS votre enfant, vous est-il arrivé de : écouter la radio (y compris sur internet)","RADIO","A07R_RADIO",null,null,"donnée","dico",null,"E7A_FREQFOIS",null,null,"réferent","Mode de vie, voisinage",null,null,null,null,null,null,"Vos loisirs"]
[null,null,null,"Et toujours au cours des 12 DERNIERS MOIS, que ce soit AVEC ou SANS votre enfant, vous est-il arrivé de : écouter de la musique (CD, DVD, sites musicaux internet, MP3)","MUSI","A07R_MUSI",null,null,"donnée","dico",null,"E7A_FREQFOIS",null,null,"réferent","Mode de vie, voisinage",null,null,null,null,null,null,"Vos loisirs"]
[null,null,null,"Et toujours au cours des 12 DERNIERS MOIS, que ce soit AVEC ou SANS votre enfant, vous est-il arrivé de : jouer à des jeux vidéo (y compris sur internet)","VIDEO","A07R_VIDEO",null,null,"donnée","dico",null,"E7A_FREQFOIS",null,null,"réferent","Mode de vie, voisinage",null,null,null,null,null,null,"Vos loisirs"]
[null,null,null,"Et toujours au cours des 12 DERNIERS MOIS, que ce soit AVEC ou SANS votre enfant, vous est-il arrivé de : lire des journaux, des magazines (y compris sur internet et journaux gratuits)","JOUR","A07R_JOUR",null,null,"donnée","dico",null,"E7A_FREQFOIS",null,null,"réferent","Mode de vie, voisinage",null,null,null,null,null,null,"Vos loisirs"]
[null,null,null,"Et toujours au cours des 12 DERNIERS MOIS, que ce soit AVEC ou SANS votre enfant, vous est-il arrivé de : lire des bandes dessinées (quel que soit le support)","BD","A07R_BD",null,null,"donnée","dico",null,"E7A_FREQFOIS",null,null,"réferent","Mode de vie, voisinage",null,null,null,null,null,null,"Vos loisirs"]
[null,null,null,"Et toujours au cours des 12 DERNIERS MOIS, que ce soit AVEC ou SANS votre enfant, vous est-il arrivé de : lire des livres sans compter les bandes dessinées (quel que soit le support)","LIVR","A07R_LIVR",null,null,"donnée","dico",null,"E7A_FREQFOIS",null,null,"réferent","Mode de vie, voisinage",null,null,null,null,null,null,"Vos loisirs"]
[null,null,null,"Au cours des 12 DERNIERS MOIS, combien de livres environ avez-vous lus pour le plaisir, en excluant vos lectures professionnelles, les BD et les livres lus aux enfants (quel que soit le support y compris sur internet) ?","NBLIVR","A07R_NBLIVR",null,null,"donnée","dico",null,"E7A_FREQNB",null,null,"réferent","Mode de vie, voisinage",null,null,null,null,null,null,"Vos loisirs"]
[null,null,null,"Combien de temps passez-vous devant un écran quel qu’il soit (télévision, ordinateur, tablette, téléphone portable) À VOTRE DOMICILE pour votre loisir ? Un jour de semaine : heures","PARECRANSEMH","A07R_PARECRANSEMH",null,null,"donnée","num",null,"",null,null,"réferent","Mode de vie, voisinage",null,null,null,null,null,null,"Vos loisirs"]
[null,null,null,"Combien de temps passez-vous devant un écran quel qu’il soit (télévision, ordinateur, tablette, téléphone portable) À VOTRE DOMICILE pour votre loisir ? Un jour de semaine : minutes","PARECRANSEMM","A07R_PARECRANSEMM",null,null,"donnée","num",null,"",null,null,"réferent","Mode de vie, voisinage",null,null,null,null,null,null,"Vos loisirs"]
[null,null,null,"Combien de temps passez-vous devant un écran quel qu’il soit (télévision, ordinateur, tablette, téléphone portable) À VOTRE DOMICILE pour votre loisir ? Un jour de week-end : heures","PARECRANWEH","A07R_PARECRANWEH",null,null,"donnée","num",null,"",null,null,"réferent","Mode de vie, voisinage",null,null,null,null,null,null,"Vos loisirs"]
[null,null,null,"Combien de temps passez-vous devant un écran quel qu’il soit (télévision, ordinateur, tablette, téléphone portable) À VOTRE DOMICILE pour votre loisir ? Un jour de week-end : minutes","PARECRANWEM","A07R_PARECRANWEM",null,null,"donnée","num",null,"",null,null,"réferent","Mode de vie, voisinage",null,null,null,null,null,null,"Vos loisirs"]
[null,null,null,"Êtes-vous abonné(e) à un journal quotidien (quel que soit le support y compris sur internet)","ABJOUR","A07R_ABJOUR",null,null,"donnée","dico",null,"E7A_YORN",null,null,"réferent","Mode de vie, voisinage",null,null,null,null,null,null,"Vos loisirs"]
[null,null,null,"Êtes-vous abonné(e) à un magazine (quel que soit le support y compris sur internet)","ABMAG","A07R_ABMAG",null,null,"donnée","dico",null,"E7A_YORN",null,null,"réferent","Mode de vie, voisinage",null,null,null,null,null,null,"Vos loisirs"]
[null,null,null,"Vous arrive-t-il d’avoir le sentiment de manquer de temps libre pour faire tout ce dont vous avez envie ?","MANQTL","A07R_MANQTL",null,null,"donnée","dico",null,"E7A_FREQTPS",null,null,"réferent","Mode de vie, voisinage","Santé mentale",null,null,null,null,null,"Vos loisirs",null,0]
[null,null,null,"CROISSANCE ET PUBERTÉ",null,null,null,null,null,null,null,null,null,null,null,null,null,null,null,null,null,null,null,null,1]
[null,null,null,"À quelle date ont été réalisées les mesures pour l’enfant ? Le jour","JMESENF","A07R_JMESENF",null,null,"non-disponible","num",null,"",null,null,"réferent","Anthropométrie",null,null,null,null,null,null,"Croissance et puberté"]
[null,null,null,"À quelle date ont été réalisées les mesures pour l’enfant ? Le mois","MMESENF","A07R_MMESENF",null,null,"non-disponible","num",null,"",null,null,"réferent","Anthropométrie",null,null,null,null,null,null,"Croissance et puberté"]
[null,null,null,"À quelle date ont été réalisées les mesures pour l’enfant ? L’année*/","AMESENF","A07R_AMESENF",null,null,"non-disponible","num",null,"",null,null,"réferent","Anthropométrie",null,null,null,null,null,null,"Croissance et puberté"]
[null,null,null,"Quel est son poids ?","POIDSENF","A07R_POIDSENF",null,null,"donnée","dico",null,"NLNUM",null,null,"réferent","Anthropométrie",null,null,null,null,null,null,"Croissance et puberté"]
[null,null,null,"Quelle est sa taille ?","TAILLENF","A07R_TAILLENF",null,null,"donnée","dico",null,"NLNUM",null,null,"réferent","Anthropométrie",null,null,null,null,null,null,"Croissance et puberté"]
[null,null,null,"Quel est son tour de taille ?","TRTAILLENF","A07R_TRTAILLENF",null,null,"donnée","dico",null,"NLNUM",null,null,"réferent","Anthropométrie",null,null,null,null,null,null,"Croissance et puberté"]
[null,null,null,"À quelle date ont été réalisées les mesures pour la mère ? Le jour","JMESMER","A07R_JMESMER",null,null,"non-disponible","num",null,"",null,null,"réferent","Anthropométrie",null,null,null,null,null,null,"Croissance et puberté"]
[null,null,null,"À quelle date ont été réalisées les mesures pour la mère ? Le mois","MMESMER","A07R_MMESMER",null,null,"non-disponible","num",null,"",null,null,"réferent","Anthropométrie",null,null,null,null,null,null,"Croissance et puberté"]
[null,null,null,"À quelle date ont été réalisées les mesures pour la mère ? L’année","AMESMER","A07R_AMESMER",null,null,"non-disponible","num",null,"",null,null,"réferent","Anthropométrie",null,null,null,null,null,null,"Croissance et puberté"]
[null,null,null,"Quel est son poids ?","POIDSMER","A07R_POIDSMER",null,null,"donnée","dico",null,"NLNUM",null,null,"réferent","Anthropométrie",null,null,null,null,null,null,"Croissance et puberté"]
[null,null,null,"Quelle est sa taille ?","TAILLEMER","A07R_TAILLEMER",null,null,"donnée","dico",null,"NLNUM",null,null,"réferent","Anthropométrie",null,null,null,null,null,null,"Croissance et puberté"]
[null,null,null,"Quel est son tour de taille ?","TRTAILLEMER","A07R_TRTAILLEMER",null,null,"donnée","dico",null,"NLNUM",null,null,"réferent","Anthropométrie",null,null,null,null,null,null,"Croissance et puberté"]
[null,null,null,"À quelle date ont été réalisées les mesures pour le père ? Le jour","JMESAUTP","A07R_JMESAUTP",null,null,"non-disponible","num",null,"",null,null,"réferent","Anthropométrie",null,null,null,null,null,null,"Croissance et puberté"]
[null,null,null,"À quelle date ont été réalisées les mesures pour le père ? Le mois","MMESAUTP","A07R_MMESAUTP",null,null,"non-disponible","num",null,"",null,null,"réferent","Anthropométrie",null,null,null,null,null,null,"Croissance et puberté"]
[null,null,null,"À quelle date ont été réalisées les mesures pour le père ? L’année","AMESAUTP","A07R_AMESAUTP",null,null,"non-disponible","num",null,"",null,null,"réferent","Anthropométrie",null,null,null,null,null,null,"Croissance et puberté"]
[null,null,null,"Quel est son poids ?","POIDSAUTP","A07R_POIDSAUTP",null,null,"donnée","dico",null,"NLNUM",null,null,"réferent","Anthropométrie",null,null,null,null,null,null,"Croissance et puberté"]
[null,null,null,"Quelle est sa taille ?","TAILLEAUTP","A07R_TAILLEAUTP",null,null,"donnée","dico",null,"NLNUM",null,null,"réferent","Anthropométrie",null,null,null,null,null,null,"Croissance et puberté"]
[null,null,null,"Quel est son tour de taille ?","TRTAILLEAUTP","A07R_TRTAILLEAUTP",null,null,"donnée","dico",null,"NLNUM",null,null,"réferent","Anthropométrie",null,null,null,null,null,null,"Croissance et puberté"]
[null,null,null,"À quelle image correspond le développement des seins de votre fille ?","TANSc","A07R_TANSc",null,null,"donnée","dico",null,"E7A_IMAGc",null,null,"réferent","Organes génitaux, puberté, fertilité, sexualité",null,null,null,null,null,null,"Croissance et puberté"]
[null,null,null,"Et à quelle image correspond la pilosité pubienne de votre fille ?","TANPF","A07R_TANPF",null,null,"donnée","dico",null,"E7A_IMAGE",null,null,"réferent","Organes génitaux, puberté, fertilité, sexualité",null,null,null,null,null,null,"Croissance et puberté"]
[null,null,null,"À quelle image correspond le développement des testicules et de la verge, et la pilosité pubienne de votre garçon ?","TANTGc","A07R_TANTGc",null,null,"donnée","dico",null,"E7A_IMAGc",null,null,"réferent","Organes génitaux, puberté, fertilité, sexualité",null,null,null,null,null,null,"Croissance et puberté"]
[null,null,null,"Le père de l’enfant a-t-il, au cours de sa vie, fumé régulièrement pendant au moins 1 an ?","CIGARP","A07R_CIGARP",null,null,"donnée","dico",null,"E7A_YORN_NSP",null,null,"réferent","Santé du père","Pathologie respiratoire","Expositions chimiques"]
[null,null,null,"À quel âge a-t-il commencé à fumer de façon régulière ?","CIGARAGEP","A07R_CIGARAGEP",null,null,"donnée","num",null,"",null,null,"réferent","Santé du père","Pathologie respiratoire","Expositions chimiques"]
[null,null,null," âge de l'enfant à la date de remplissage du questionnaire en mois","AGE7A","A07R_AGE7A",null,null,"donnée","num",null,"",null,null,"réferent","Anthropométrie",null,null,null,null,null,null,"Croissance et puberté"]
[null,null,null,"âge de l'enfant à la date de remplissage du questionnaire en jours","AGE7AJR","A07R_AGE7AJR",null,null,"non-disponible","num",null,"",null,null,"réferent","Anthropométrie",null,null,null,null,null,null,"Croissance et puberté"]
[null,null,null,"âge de l'enfant à la date des mesures en mois","AGE7A_DATMES","A07R_AGE7A_DATMES",null,null,"donnée","num",null,"",null,null,"réferent","Anthropométrie",null,null,null,null,null,null,"Croissance et puberté"]
[null,null,null,"âge de l'enfant à la date des mesures en jours","AGE7AJR_DATMES","A07R_AGE7AJR_DATMES",null,null,"donnée","num",null,"",null,null,"réferent","Anthropométrie",null,null,null,null,null,null,"Croissance et puberté"]
[null,null,null," âge de la mère à la date des mesures en années","AGEMER_DATMES","A07R_AGEMER_DATMES",null,null,"donnée","num",null,"",null,null,"réferent","Anthropométrie",null,null,null,null,null,null,"Croissance et puberté"]
[null,null,null,"âge du père à la date des mesures en années","AGEPER_DATMES","A07R_AGEPER_DATMES",null,null,"donnée","num",null,"",null,null,"réferent","Anthropométrie",null,null,null,null,null,null,"Croissance et puberté",null,0]
[null,null,null,"PARTICIPATION",null,null,null,null,null,null,null,null,null,null,null,null,null,null,null,null,null,null,null,null,1]
[null,null,null,"Répondant questionnaire","PARTIREF7A","A07R_PARTIREF7A",null,null,"donnée","dico",null,"E7A_PARTIR",null,null,"réferent","Gestion étude",null,null,null,null,null,null,"Participation"]
[null,null,null,"Complétude questionnaire","REFCOMP7A","A07R_REFCOMP7A",null,null,"donnée","dico",null,"E7A_REFCOM",null,null,"réferent","Gestion étude",null,null,null,null,null,null,"Participation",null,0]
[null,null,null,"CONTACT",null,null,null,null,null,null,null,null,null,null,null,null,null,null,null,null,null,null,null,null,1]
[null,null,null,"Avez-vous changé d’adresse depuis les 5 ans de votre enfant ?","CHGADRESS","A07R_CHGADRESS",null,null,"non-disponible","num",null,"E7A_YORN",null,null,"réferent","Gestion étude","Expositions chimiques","Expositions physiques",null,null,null,null,"Contact"]
[null,null,null,"Pouvez-vous nous indiquer votre adresse actuelle ? Civilité :","CIVILITE","A07R_CIVILITE",null,null,"non-disponible","num",null,"E7A_SEXEPAR",null,null,"réferent","Gestion étude","Etat civil",null,null,null,null,null,"Contact"]
[null,null,null,"Pouvez-vous nous indiquer votre adresse actuelle ? Nom :","NOMREP","A07R_NOMREP",null,null,"non-disponible","text",null,"",null,null,"réferent","Gestion étude","Etat civil",null,null,null,null,null,"Contact"]
[null,null,null,"Pouvez-vous nous indiquer votre adresse actuelle ? Prénom :","PRENREP","A07R_PRENREP",null,null,"non-disponible","text",null,"",null,null,"réferent","Gestion étude","Etat civil",null,null,null,null,null,"Contact"]
[null,null,null,"Pouvez-vous nous indiquer votre adresse actuelle ? N° et libellé de la voie :","ADR3REF","A07R_ADR3REF",null,null,"non-disponible","text",null,"",null,null,"réferent","Gestion étude","Expositions chimiques","Expositions physiques",null,null,null,null,"Contact"]
[null,null,null,"Pouvez-vous nous indiquer votre adresse actuelle ? Complément d’adresse :","ADR2REF","A07R_ADR2REF",null,null,"non-disponible","text",null,"",null,null,"réferent","Gestion étude","Expositions chimiques","Expositions physiques",null,null,null,null,"Contact"]
[null,null,null,"Pouvez-vous nous indiquer votre adresse actuelle ? Code postal :","ADRCPREF","A07R_ADRCPREF",null,null,"non-disponible","text",null,"",null,null,"réferent","Gestion étude","Expositions chimiques","Expositions physiques",null,null,null,null,"Contact"]
[null,null,null,"Pouvez-vous nous indiquer votre adresse actuelle ? Commune :","ADRCOMREF","A07R_ADRCOMREF",null,null,"non-disponible","text",null,"",null,null,"réferent","Gestion étude","Expositions chimiques","Expositions physiques",null,null,null,null,"Contact"]
[null,null,null,"Pouvez-vous nous indiquer votre adresse actuelle ? Pays :","ADRPAIREF","A07R_ADRPAIREF",null,null,"non-disponible","text",null,"",null,null,"réferent","Gestion étude","Expositions chimiques","Expositions physiques",null,null,null,null,"Contact"]
[null,null,null,"Pouvez-vous nous indiquer la date d’arrivée dans votre logement actuel ? Mois","MDATDEM","A07R_MDATDEM",null,null,"non-disponible","num",null,"",null,null,"réferent","Gestion étude","Expositions chimiques","Expositions physiques",null,null,null,null,"Contact"]
[null,null,null,"Pouvez-vous nous indiquer la date d’arrivée dans votre logement actuel ? Année","ADATDEM","A07R_ADATDEM",null,null,"non-disponible","num",null,"",null,null,"réferent","Gestion étude","Expositions chimiques","Expositions physiques",null,null,null,null,"Contact"]
[null,null,null,"Avez-vous changé de numéro de téléphone ou d’adresse e-mail depuis les 5 ans de votre enfant ?","CHGTELMAIL","A07R_CHGTELMAIL",null,null,"non-disponible","num",null,"E7A_YORN",null,null,"réferent","Gestion étude",null,null,null,null,null,null,"Contact"]
[null,null,null,"Pouvez-vous nous indiquer votre numéro de téléphone et votre adresse e-mail ? Numéro de téléphone :","TELREF7","A07R_TELREF7",null,null,"non-disponible","text",null,"",null,null,"réferent","Gestion étude",null,null,null,null,null,null,"Contact"]
[null,null,null,"Pouvez-vous nous indiquer votre numéro de téléphone et votre adresse e-mail ? E-mail :","EMAILREF7","A07R_EMAILREF7",null,null,"non-disponible","text",null,"",null,null,"réferent","Gestion étude",null,null,null,null,null,null,"Contact",null,0]

{"sheet":"E9A_ECOLE","index":9,"n_rows":398,"n_cols":73,"rows_kept":398,"cut":false,"hidden":false,"merged":[]}
["SELECTION\n(par variable ou par section)","SELECTION\n(par thème 1)","SELECTION\n(par QUEST STANDARD)","LABEL","QUESTION QUESTIONNAIRE","QUESTION BASE","QUESTION BASE",null,"TYPE","FORMAT","CHAPEAU","DICO","DESCRIPTION","CONTRÔLE","THEME(01)","THEME(02)","THEME(03)","THEME1","THEME2","THEME3","THEME4","THEME5","THEME6","QUEST STANDARD","THEME_TITRE","","","","","","","","","","","","","","","","","","","","","","","","","","E9A_SAPRIS_VARIABLES","E9AEC_VAR","","","","","","","","","","","","","","","","","","","","",""]
[null,null,null,{"$f":"CONCATENATE(\"Sélection totale : \",COUNTIFS(A:A,\"X\",I:I,\"*\")+COUNTIFS(B:B,\"X\",I:I,\"*\")+COUNTIFS(C:C,\"X\",I:I,\"*\"),\" variable(s)\")","v":"Sélection totale : 0 variable(s)"},null,null,null,null,null,null,null,null,null,null,null,null,null,null,null,null,null,null,null,null,null,null,{"$f":"COUNTIFS(A:A,\"X\",I:I,\"non-disponible\")+COUNTIFS(B:B,\"X\",I:I,\"non-disponible\")+COUNTIFS(C:C,\"X\",I:I,\"non-disponible\")","v":0},{"$f":"SUM(COUNTIFS($A:$A,\"X\",$E:$E,{\"ACRELI\";\"ACCHRET\";\"ACMUSUL\";\"LRELI\";\"QLCHRET\";\"QLMUSUL\";\"POLIT\"})+COUNTIFS($B:$B,\"X\",$E:$E,{\"ACRELI\";\"ACCHRET\";\"ACMUSUL\";\"LRELI\";\"QLCHRET\";\"QLMUSUL\";\"POLIT\"})+COUNTIFS($C:$C,\"X\",$E:$E,{\"ACRELI\";\"ACCHRET\";\"ACMUSUL\";\"LRELI\";\"QLCHRET\";\"QLMUSUL\";\"POLIT\"}))","v":0}]
[null,null,null,"GESTION",null,null,null,null,null,null,null,null,null,null,null,null,null,null,null,null,null,null,null,null,1]
[null,null,null,"Numéro de vague","VAGUE","A09X_VAGUE",null,1,"donnée","dico",null,"E9A_EC_VAGUE","Numéro de vague",null,"9ans","auto-questionnaire ecole","gestion","","","","","","gestion PGD",""]
[null,null,null,"9 ans école : eligibilité","ELIG","A09X_ELIG",null,2,"donnée","dico",null,"E9A_EC_GESTELIG","9 ans école : eligibilité",null,"9ans","auto-questionnaire ecole","gestion","","","","","","gestion PGD",""]
[null,null,null,"9 ans école : motif de non éligibilité","ELIG2MOT","A09X_ELIG2MOT",null,3,"donnée","dico",null,"E9A_EC_GESTELIG2MOT","9 ans école : motif de non éligibilité",null,"9ans","auto-questionnaire ecole","gestion","","","","","","gestion PGD",""]
[null,null,null,"9 ans école : motif de non éligibilité (précision)","ELIG2MOT8PR","A09X_ELIG2MOT8PR",null,4,"non-disponible","text",null,"","9 ans école : motif de non éligibilité (précision)",null,"9ans","auto-questionnaire ecole","gestion","","","","","","gestion PGD",""]
[null,null,null,"9 ans école : prise de contact","IN","A09X_IN",null,5,"donnée","dico",null,"E9A_EC_GESTIN","9 ans école : prise de contact",null,"9ans","auto-questionnaire ecole","gestion","","","","","","gestion PGD",""]
[null,null,null,"9 ans école : motif de non prise de contact","IN2MOT","A09X_IN2MOT",null,6,"donnée","dico",null,"E9A_EC_GESTIN2MOT","9 ans école : motif de non prise de contact",null,"9ans","auto-questionnaire ecole","gestion","","","","","","gestion PGD",""]
[null,null,null,"9 ans école : motif de non prise de contact (précision)","IN2MOT8PR","A09X_IN2MOT8PR",null,7,"non-disponible","text",null,"","9 ans école : motif de non prise de contact (précision)",null,"9ans","auto-questionnaire ecole","gestion","","","","","","gestion PGD",""]
[null,null,null,"9 ans école : retour de collecte","OUT","A09X_OUT",null,8,"donnée","dico",null,"E9A_EC_GESTOUT","9 ans école : retour de collecte",null,"9ans","auto-questionnaire ecole","gestion","","","","","","gestion PGD",""]
[null,null,null,"9 ans école : motif de non retour de collecte","OUT2MOT","A09X_OUT2MOT",null,9,"donnée","dico",null,"E9A_EC_GESTOUT2MOT","9 ans école : motif de non retour de collecte",null,"9ans","auto-questionnaire ecole","gestion","","","","","","gestion PGD",""]
[null,null,null,"9 ans école : motif de non retour de collecte (précision)","OUT2MOT8PR","A09X_OUT2MOT8PR",null,10,"non-disponible","text",null,"","9 ans école : motif de non retour de collecte (précision)",null,"9ans","auto-questionnaire ecole","gestion","","","","","","gestion PGD",""]
[null,null,null,"Nombre d'enfants elfe par école","SYSADM","A09X_SYSADM",null,11,"donnée","dico",null,"E9A_EC_GESTSYSADM","9 ans école : systéme d'administration du questionnaire",null,"9ans","auto-questionnaire ecole","gestion","","","","","","gestion PGD",""]
[null,null,null,"Numéro identification école","FINESS","A09X_FINESS",null,13,"non-disponible","text",null,"","Numéro identification école",null,"9ans","auto-questionnaire ecole","gestion","","","","","","gestion PGD",""]
[null,null,null,"Education prioritaire","REP","A09X_REP",null,14,"donnée","dico",null,"E9A_EC_REP","Education prioritaire",null,"9ans","auto-questionnaire ecole","gestion","","","","","","gestion PGD",""]
[null,null,null,"Education prioritaire (plus)","REPPLUS","A09X_REPPLUS",null,15,"donnée","dico",null,"E9A_EC_REPP","Education prioritaire (plus)",null,"9ans","auto-questionnaire ecole","gestion","","","","","","gestion PGD",""]
[null,null,null,"Secteur public/privé","PUBLPRIV","A09X_PUBLPRIV",null,16,"donnée","dico",null,"E9A_EC_PUPR","Secteur public/privé",null,"9ans","auto-questionnaire ecole","gestion","","","","","","gestion PGD",""]
[null,null,null,"Département école","DEP","A09X_DEP",null,17,"non-disponible","text",null,"","Département école",null,"9ans","auto-questionnaire ecole","gestion","","","","","","gestion PGD",""]
[null,null,null,"Code géographique de l'école (insee)","GEOCODEC","A09X_GEOCODEC",null,18,"non-disponible","text",null,null,"Commune école (code insee)",null,"9ans","auto-questionnaire ecole","gestion","","","","","","gestion PGD",""]
[null,null,null,"Premières lettres prénom enfant elfe (3)","PREMLETT","A09X_PREMLETT",null,20,"non-disponible","text",null,"","Premières lettres prénom enfant elfe",null,"9ans","auto-questionnaire ecole","gestion","","","","","","gestion",""]
[null,null,null,"Identifiant Enfant","NIE","A09X_NIE",null,21,"non-disponible","float",null,null,"Numéro identifant enfant",null,"9ans","auto-questionnaire ecole","gestion",null,null,null,null,null,"gestion"]
[null,null,null,"Nombre de réponses aux exercices","NBREPENF","A09X_NBREPENF",null,null,"donnée","float",null,"","Nombre de variables répondues questionnaire enfant",null,"9ans","auto-questionnaire ecole","gestion","","","","","","gestion",""]
[null,null,null,"Nombre de réponses au questionnaire enseignant","NBREPENS","A09X_NBREPENS",null,null,"donnée","float",null,"","Nombre de variables répondues questionnaire enseignant",null,"9ans","auto-questionnaire ecole","gestion","","","","","","gestion",""]
[null,null,null,"Numéro de l'enfant (enfant elfe=1)","ENFELFE","A09X_ENFELFE",null,null,"donnée","float",null,"","Numéro de l'enfant elfe (enfant elfe=1)",null,"9ans","auto-questionnaire ecole","gestion","","","","","","gestion",""]
[null,null,null,"Nombre d'enfants ayant réalisé les exercices (nombre de colonnes renseignées)","NBENFQUEST","A09X_NBENFQUEST",null,null,"donnée","float",null,"","Nombre d'enfants par questionnaire",null,"9ans","auto-questionnaire ecole","gestion","","","","","","gestion",""]
[null,null,null,"cohorte (Elfe / Epipage / DEVOM)","lfEpi","flg_elfEpi",null,null,"donnée","float",null,null,null,null,null,null,null,null,null,null,null,null,null,null,0]
[null,null,null,"ETAT CIVIL",null,null,null,null,null,null,null,null,null,null,null,null,null,null,null,null,null,null,null,null,1]
[null,null,null,"Mois de naissance","DATNAISSM","A09X_DATNAISSM",null,22,"non-disponible","dico",null,"E9A_EC_DATNAISSM","Mois de naissance",null,"9ans","auto-questionnaire ecole","etat civil","","","","","","etat civil",""]
[null,null,null,"Age en nombre de mois de l'enfant","AGE9M","A09X_AGE9M",null,23,"donnée","float",null,"","Age en nombre de mois de l'enfant",null,"9ans","auto-questionnaire ecole","etat civil","","","","","","etat civil",""]
[null,null,null,"Age en nombre de jours de l'enfant","AGE9AJR","A09X_AGE9AJR",null,24,"non-disponible","float",null,"","Age en nombre de jours de l'enfant",null,"9ans","auto-questionnaire ecole","etat civil","","","","","","etat civil",""]
[null,null,null,"Sexe de l'enfant","SEXE","A09X_SEXE",null,26,"donnée","dico",null,"E9A_EC_SEXE","Sexe de l’enfant",null,"9ans","auto-questionnaire ecole","etat civil","","","","","","etat civil","",0]
[null,null,null,"QUESTIONNAIRE ENFANT",null,null,null,null,null,null,null,null,null,null,null,null,null,null,null,null,null,null,null,null,1]
[null,null,null,"Nombre total d’objets entourés parmi les 16 proposés","ENCHEV1","A09X_ENCHEV1",null,27,"donnée","float",null,null,"Nombre total d’objets entourés parmi les 16 proposés",null,"9ans","auto-questionnaire ecole","questionnaire enfant","","","","","","exercices de dénombrement",""]
[null,null,null,"Sous-total parmi les 5 objets distracteurs","ENCHEV2","A09X_ENCHEV2",null,28,"donnée","float",null,null,"Sous-total parmi les 5 objets distracteurs",null,"9ans","auto-questionnaire ecole","questionnaire enfant","","","","","","exercices de dénombrement",""]
[null,null,null,"Multiplier (3x4)","CALCUL12_rc","A09X_CALCUL12_rc",null,null,"donnée","dico",null,"E9A_EC_FORMAT1F","Multiplier (3x4)",null,"9ans","auto-questionnaire ecole","questionnaire enfant","","","","","","exercices de dénombrement"]
[null,null,null,"Multiplier (9x4)","CALCUL36_rc","A09X_CALCUL36_rc",null,null,"donnée","dico",null,"E9A_EC_FORMAT1F","Multiplier (9x4)",null,"9ans","auto-questionnaire ecole","questionnaire enfant","","","","","","exercices de dénombrement"]
[null,null,null,"Multiplier (7x6)","CALCUL42_rc","A09X_CALCUL42_rc",null,null,"donnée","dico",null,"E9A_EC_FORMAT1F","Multiplier (7x6)",null,"9ans","auto-questionnaire ecole","questionnaire enfant","","","","","","exercices de dénombrement"]
[null,null,null,"Déduire (3x?=18)","CALCUL6A_rc","A09X_CALCUL6A_rc",null,null,"donnée","dico",null,"E9A_EC_FORMAT1F","Déduire (3x?=18)",null,"9ans","auto-questionnaire ecole","questionnaire enfant","","","","","","exercices de dénombrement"]
[null,null,null,"Déduire (5x?=30)","CALCUL6B_rc","A09X_CALCUL6B_rc",null,null,"donnée","dico",null,"E9A_EC_FORMAT1F","Déduire (5x?=30)",null,"9ans","auto-questionnaire ecole","questionnaire enfant","","","","","","exercices de dénombrement"]
[null,null,null,"Déduire (?x4=40)","CALCUL10_rc","A09X_CALCUL10_rc",null,null,"donnée","dico",null,"E9A_EC_FORMAT1F","Déduire (?x4=40)",null,"9ans","auto-questionnaire ecole","questionnaire enfant","","","","","","exercices de dénombrement"]
[null,null,null,"Déduire (?x3=24)","CALCUL8_rc","A09X_CALCUL8_rc",null,null,"donnée","dico",null,"E9A_EC_FORMAT1F","Déduire (?x3=24)",null,"9ans","auto-questionnaire ecole","questionnaire enfant","","","","","","exercices de dénombrement"]
[null,null,null,"Diviser (50:2)","CALCUL25_rc","A09X_CALCUL25_rc",null,null,"donnée","dico",null,"E9A_EC_FORMAT1F","Diviser (50:2)",null,"9ans","auto-questionnaire ecole","questionnaire enfant","","","","","","exercices de dénombrement"]
[null,null,null,"Multiplier (5x80)","CALCUL400_rc","A09X_CALCUL400_rc",null,null,"donnée","dico",null,"E9A_EC_FORMAT1F","Multiplier (5x80)",null,"9ans","auto-questionnaire ecole","questionnaire enfant","","","","","","exercices de dénombrement"]
[null,null,null,"Diviser (64:2)","CALCUL32_rc","A09X_CALCUL32_rc",null,null,"donnée","dico",null,"E9A_EC_FORMAT1F","Diviser (64:2)",null,"9ans","auto-questionnaire ecole","questionnaire enfant","","","","","","exercices de dénombrement"]
[null,null,null,"Multiplier (3x4)","CALCUL12","A09X_CALCUL12",null,null,"donnée","float",null,null,"Multiplier (3x4)",null,"9ans","auto-questionnaire ecole","questionnaire enfant","","","","","","exercices de dénombrement",""]
[null,null,null,"Multiplier (9x4)","CALCUL36","A09X_CALCUL36",null,null,"donnée","float",null,null,"Multiplier (9x4)",null,"9ans","auto-questionnaire ecole","questionnaire enfant","","","","","","exercices de dénombrement",""]
[null,null,null,"Multiplier (7x6)","CALCUL42","A09X_CALCUL42",null,null,"donnée","float",null,null,"Multiplier (7x6)",null,"9ans","auto-questionnaire ecole","questionnaire enfant","","","","","","exercices de dénombrement",""]
[null,null,null,"Déduire (3x?=18)","CALCUL6A","A09X_CALCUL6A",null,null,"donnée","float",null,null,"Déduire (3x?=18)",null,"9ans","auto-questionnaire ecole","questionnaire enfant","","","","","","exercices de dénombrement",""]
[null,null,null,"Déduire (5x?=30)","CALCUL6B","A09X_CALCUL6B",null,null,"donnée","float",null,null,"Déduire (5x?=30)",null,"9ans","auto-questionnaire ecole","questionnaire enfant","","","","","","exercices de dénombrement",""]
[null,null,null,"Déduire (?x4=40)","CALCUL10","A09X_CALCUL10",null,null,"donnée","float",null,null,"Déduire (?x4=40)",null,"9ans","auto-questionnaire ecole","questionnaire enfant","","","","","","exercices de dénombrement",""]
[null,null,null,"Déduire (?x3=24)","CALCUL8","A09X_CALCUL8",null,null,"donnée","float",null,null,"Déduire (?x3=24)",null,"9ans","auto-questionnaire ecole","questionnaire enfant","","","","","","exercices de dénombrement",""]
[null,null,null,"Diviser (50:2)","CALCUL25","A09X_CALCUL25",null,null,"donnée","float",null,null,"Diviser (50:2)",null,"9ans","auto-questionnaire ecole","questionnaire enfant","","","","","","exercices de dénombrement",""]
[null,null,null,"Multiplier (5x80)","CALCUL400","A09X_CALCUL400",null,null,"donnée","float",null,null,"Multiplier (5x80)",null,"9ans","auto-questionnaire ecole","questionnaire enfant","","","","","","exercices de dénombrement",""]
[null,null,null,"Diviser (64:2)","CALCUL32","A09X_CALCUL32",null,null,"donnée","float",null,null,"Diviser (64:2)",null,"9ans","auto-questionnaire ecole","questionnaire enfant","","","","","","exercices de dénombrement",""]
[null,null,null,"Pierre a quatre bonbons","PROBLEM8_rc","A09X_PROBLEM8_rc",null,null,"donnée","dico",null,"E9A_EC_FORMAT1F","Pierre a quatre bonbons",null,"9ans","auto-questionnaire ecole","questionnaire enfant","","","","","","exercices de dénombrement",""]
[null,null,null,"Combien de stylos dans 20 paquets","PROBLEM40_rc","A09X_PROBLEM40_rc",null,null,"donnée","dico",null,"E9A_EC_FORMAT1F","Combien de stylos dans 20 paquets",null,"9ans","auto-questionnaire ecole","questionnaire enfant","","","","","","exercices de dénombrement",""]
[null,null,null,"Sylvia a 8€ dans son porte-monnaie","PROBLEM10A_rc","A09X_PROBLEM10A_rc",null,null,"donnée","dico",null,"E9A_EC_FORMAT1F","Sylvia a 8€ dans son porte-monnaie",null,"9ans","auto-questionnaire ecole","questionnaire enfant","","","","","","exercices de dénombrement",""]
[null,null,null,"Monsieur Dupont partage 40 images ","PROBLEM10B_rc","A09X_PROBLEM10B_rc",null,null,"donnée","dico",null,"E9A_EC_FORMAT1F","Monsieur Dupont partage 40 images ",null,"9ans","auto-questionnaire ecole","questionnaire enfant","","","","","","exercices de dénombrement",""]
[null,null,null,"Une maîtresse partage 30 gâteaux","PROBLEM3A_rc","A09X_PROBLEM3A_rc",null,null,"donnée","dico",null,"E9A_EC_FORMAT1F","Une maîtresse partage 30 gâteaux",null,"9ans","auto-questionnaire ecole","questionnaire enfant","","","","","","exercices de dénombrement",""]
[null,null,null,"Une bouteille de jus de pomme coûte 2€","PROBLEM3b_rc","A09X_PROBLEM3b_rc",null,null,"donnée","dico",null,"E9A_EC_FORMAT1F","Une bouteille de jus de pomme coûte 2€",null,"9ans","auto-questionnaire ecole","questionnaire enfant","","","","","","exercices de dénombrement",""]
[null,null,null,"Pierre a quatre bonbons","PROBLEM8","A09X_PROBLEM8",null,null,"donnée","float",null,null,"Pierre a quatre bonbons",null,"9ans","auto-questionnaire ecole","questionnaire enfant","","","","","","exercices de dénombrement",""]
[null,null,null,"Combien de stylos dans 20 paquets","PROBLEM40","A09X_PROBLEM40",null,null,"donnée","float",null,null,"Combien de stylos dans 20 paquets",null,"9ans","auto-questionnaire ecole","questionnaire enfant","","","","","","exercices de dénombrement",""]
[null,null,null,"Sylvia a 8€ dans son porte-monnaie","PROBLEM10A","A09X_PROBLEM10A",null,null,"donnée","float",null,null,"Sylvia a 8€ dans son porte-monnaie",null,"9ans","auto-questionnaire ecole","questionnaire enfant","","","","","","exercices de dénombrement",""]
[null,null,null,"Monsieur Dupont partage 40 images ","PROBLEM10B","A09X_PROBLEM10B",null,null,"donnée","float",null,null,"Monsieur Dupont partage 40 images ",null,"9ans","auto-questionnaire ecole","questionnaire enfant","","","","","","exercices de dénombrement",""]
[null,null,null,"Une maîtresse partage 30 gâteaux","PROBLEM3A","A09X_PROBLEM3A",null,null,"donnée","float",null,null,"Une maîtresse partage 30 gâteaux",null,"9ans","auto-questionnaire ecole","questionnaire enfant","","","","","","exercices de dénombrement",""]
[null,null,null,"Une bouteille de jus de pomme coûte 2€","PROBLEM3B","A09X_PROBLEM3B",null,null,"donnée","float",null,null,"Une bouteille de jus de pomme coûte 2€",null,"9ans","auto-questionnaire ecole","questionnaire enfant","","","","","","exercices de dénombrement",""]
[null,null,null,"Compléter une suite numérique croissante de pas égal à 4","SUITE20","A09X_SUITE20",null,null,"donnée","dico",null,"E9A_EC_FORMAT2F","Compléter une suite numérique croissante de pas égal à 4",null,"9ans","auto-questionnaire ecole","questionnaire enfant","","","","","","exercices de dénombrement",""]
[null,null,null,"Compléter une suite numérique croissante de pas égal à 7","SUITE37","A09X_SUITE37",null,null,"donnée","dico",null,"E9A_EC_FORMAT2F","Compléter une suite numérique croissante de pas égal à 7",null,"9ans","auto-questionnaire ecole","questionnaire enfant","","","","","","exercices de dénombrement",""]
[null,null,null,"Compléter une suite numérique croissante de pas égal à 8","SUITE143","A09X_SUITE143",null,null,"donnée","dico",null,"E9A_EC_FORMAT2F","Compléter une suite numérique croissante de pas égal à 8",null,"9ans","auto-questionnaire ecole","questionnaire enfant","","","","","","exercices de dénombrement",""]
[null,null,null,"Compléter une suite numérique croissante de pas égal à 9","SUITE164","A09X_SUITE164",null,null,"donnée","dico",null,"E9A_EC_FORMAT2F","Compléter une suite numérique croissante de pas égal à 9",null,"9ans","auto-questionnaire ecole","questionnaire enfant","","","","","","exercices de dénombrement",""]
[null,null,null,"Compléter une suite numérique croissante de pas égal à 20","SUITE314","A09X_SUITE314",null,null,"donnée","dico",null,"E9A_EC_FORMAT2F","Compléter une suite numérique croissante de pas égal à 20",null,"9ans","auto-questionnaire ecole","questionnaire enfant","","","","","","exercices de dénombrement",""]
[null,null,null,"Compléter une suite numérique décroissante de pas égal à 3","SUITE15","A09X_SUITE15",null,null,"donnée","dico",null,"E9A_EC_FORMAT2F","Compléter une suite numérique décroissante de pas égal à 3",null,"9ans","auto-questionnaire ecole","questionnaire enfant","","","","","","exercices de dénombrement",""]
[null,null,null,"Compléter une suite numérique décroissante de pas égal à 7","SUITE28","A09X_SUITE28",null,null,"donnée","dico",null,"E9A_EC_FORMAT2F","Compléter une suite numérique décroissante de pas égal à 7",null,"9ans","auto-questionnaire ecole","questionnaire enfant","","","","","","exercices de dénombrement",""]
[null,null,null,"Compléter une suite numérique décroissante de pas égal à 4","SUITE97","A09X_SUITE97",null,null,"donnée","dico",null,"E9A_EC_FORMAT2F","Compléter une suite numérique décroissante de pas égal à 4",null,"9ans","auto-questionnaire ecole","questionnaire enfant","","","","","","exercices de dénombrement",""]
[null,null,null,"Compléter une suite numérique décroissante de pas égal à 11","SUITE127","A09X_SUITE127",null,null,"donnée","dico",null,"E9A_EC_FORMAT2F","Compléter une suite numérique décroissante de pas égal à 11",null,"9ans","auto-questionnaire ecole","questionnaire enfant","","","","","","exercices de dénombrement",""]
[null,null,null,"Compléter une suite numérique décroissante de pas égal à 30","SUITE223","A09X_SUITE223",null,null,"donnée","dico",null,"E9A_EC_FORMAT2F","Compléter une suite numérique décroissante de pas égal à 30",null,"9ans","auto-questionnaire ecole","questionnaire enfant","","","","","","exercices de dénombrement",""]
[null,null,null,"Placer un nombre sur une ligne graduée de 0 à 100","GRAD12_rc","A09X_GRAD12_rc",null,null,"donnée","dico",null,"E9A_GRAD","Placer un nombre sur une ligne graduée de 0 à 100",null,"9ans","auto-questionnaire ecole","questionnaire enfant","","","","","","exercices de dénombrement",""]
[null,null,null,"Placer un nombre sur une ligne graduée de 0 à 100","GRAD82_rc","A09X_GRAD82_rc",null,null,"donnée","dico",null,"E9A_GRAD","Placer un nombre sur une ligne graduée de 0 à 100",null,"9ans","auto-questionnaire ecole","questionnaire enfant","","","","","","exercices de dénombrement",""]
[null,null,null,"Placer un nombre sur une ligne graduée de 0 à 100","GRAD68_rc","A09X_GRAD68_rc",null,null,"donnée","dico",null,"E9A_GRAD","Placer un nombre sur une ligne graduée de 0 à 100",null,"9ans","auto-questionnaire ecole","questionnaire enfant","","","","","","exercices de dénombrement",""]
[null,null,null,"Placer un nombre sur une ligne graduée de 0 à 100","GRAD26_rc","A09X_GRAD26_rc",null,null,"donnée","dico",null,"E9A_GRAD","Placer un nombre sur une ligne graduée de 0 à 100",null,"9ans","auto-questionnaire ecole","questionnaire enfant","","","","","","exercices de dénombrement",""]
[null,null,null,"Placer un nombre sur une ligne graduée de 0 à 1000","GRAD784_rc","A09X_GRAD784_rc",null,null,"donnée","dico",null,"E9A_GRAD","Placer un nombre sur une ligne graduée de 0 à 1000",null,"9ans","auto-questionnaire ecole","questionnaire enfant","","","","","","exercices de phonologie",""]
[null,null,null,"Placer un nombre sur une ligne graduée de 0 à 1000","GRAD114_rc","A09X_GRAD114_rc",null,null,"donnée","dico",null,"E9A_GRAD","Placer un nombre sur une ligne graduée de 0 à 1000",null,"9ans","auto-questionnaire ecole","questionnaire enfant","","","","","","exercices de phonologie",""]
[null,null,null,"Placer un nombre sur une ligne graduée de 0 à 1000","GRAD915_rc","A09X_GRAD915_rc",null,null,"donnée","dico",null,"E9A_GRAD","Placer un nombre sur une ligne graduée de 0 à 1000",null,"9ans","auto-questionnaire ecole","questionnaire enfant","","","","","","exercices de phonologie",""]
[null,null,null,"Placer un nombre sur une ligne graduée de 0 à 1000","GRAD485_rc","A09X_GRAD485_rc",null,null,"donnée","dico",null,"E9A_GRAD","Placer un nombre sur une ligne graduée de 0 à 1000",null,"9ans","auto-questionnaire ecole","questionnaire enfant","","","","","","exercices de phonologie",""]
[null,null,null,"Placer un nombre sur une ligne graduée de 0 à 1000","GRAD512_rc","A09X_GRAD512_rc",null,null,"donnée","dico",null,"E9A_GRAD","Placer un nombre sur une ligne graduée de 0 à 1000",null,"9ans","auto-questionnaire ecole","questionnaire enfant","","","","","","exercices de phonologie",""]
[null,null,null,"Placer un nombre sur une ligne graduée de 0 à 1000","GRAD337_rc","A09X_GRAD337_rc",null,null,"donnée","dico",null,"E9A_GRAD","Placer un nombre sur une ligne graduée de 0 à 1000",null,"9ans","auto-questionnaire ecole","questionnaire enfant","","","","","","exercices de phonologie",""]
[null,null,null,"Placer un nombre sur une ligne graduée de 0 à 100","GRAD12","A09X_GRAD12",null,null,"donnée","float",null,null,"Placer un nombre sur une ligne graduée de 0 à 100",null,"9ans","auto-questionnaire ecole","questionnaire enfant","","","","","","exercices de dénombrement",""]
[null,null,null,"Placer un nombre sur une ligne graduée de 0 à 100","GRAD82","A09X_GRAD82",null,null,"donnée","float",null,null,"Placer un nombre sur une ligne graduée de 0 à 100",null,"9ans","auto-questionnaire ecole","questionnaire enfant","","","","","","exercices de dénombrement",""]
[null,null,null,"Placer un nombre sur une ligne graduée de 0 à 100","GRAD68","A09X_GRAD68",null,null,"donnée","float",null,null,"Placer un nombre sur une ligne graduée de 0 à 100",null,"9ans","auto-questionnaire ecole","questionnaire enfant","","","","","","exercices de dénombrement",""]
[null,null,null,"Placer un nombre sur une ligne graduée de 0 à 100","GRAD26","A09X_GRAD26",null,null,"donnée","float",null,null,"Placer un nombre sur une ligne graduée de 0 à 100",null,"9ans","auto-questionnaire ecole","questionnaire enfant","","","","","","exercices de dénombrement",""]
[null,null,null,"Placer un nombre sur une ligne graduée de 0 à 1000","GRAD784","A09X_GRAD784",null,null,"donnée","float",null,null,"Placer un nombre sur une ligne graduée de 0 à 1000",null,"9ans","auto-questionnaire ecole","questionnaire enfant","","","","","","exercices de phonologie",""]
[null,null,null,"Placer un nombre sur une ligne graduée de 0 à 1000","GRAD114","A09X_GRAD114",null,null,"donnée","float",null,null,"Placer un nombre sur une ligne graduée de 0 à 1000",null,"9ans","auto-questionnaire ecole","questionnaire enfant","","","","","","exercices de phonologie",""]
[null,null,null,"Placer un nombre sur une ligne graduée de 0 à 1000","GRAD915","A09X_GRAD915",null,null,"donnée","float",null,null,"Placer un nombre sur une ligne graduée de 0 à 1000",null,"9ans","auto-questionnaire ecole","questionnaire enfant","","","","","","exercices de phonologie",""]
[null,null,null,"Placer un nombre sur une ligne graduée de 0 à 1000","GRAD485","A09X_GRAD485",null,null,"donnée","float",null,null,"Placer un nombre sur une ligne graduée de 0 à 1000",null,"9ans","auto-questionnaire ecole","questionnaire enfant","","","","","","exercices de phonologie",""]
[null,null,null,"Placer un nombre sur une ligne graduée de 0 à 1000","GRAD512","A09X_GRAD512",null,null,"donnée","float",null,null,"Placer un nombre sur une ligne graduée de 0 à 1000",null,"9ans","auto-questionnaire ecole","questionnaire enfant","","","","","","exercices de phonologie",""]
[null,null,null,"Placer un nombre sur une ligne graduée de 0 à 1000","GRAD337","A09X_GRAD337",null,null,"donnée","float",null,null,"Placer un nombre sur une ligne graduée de 0 à 1000",null,"9ans","auto-questionnaire ecole","questionnaire enfant","","","","","","exercices de phonologie",""]
[null,null,null,"Entourer l'ombre du ballon","VISUBAL","A09X_VISUBAL",null,null,"donnée","dico",null,"E9A_EC_FORMAT3F","Entourer l'ombre du ballon",null,"9ans","auto-questionnaire ecole","questionnaire enfant","","","","","","exercices de phonologie",""]
[null,null,null,"Entourer l'ombre du chat","VISUCHA","A09X_VISUCHA",null,null,"donnée","dico",null,"E9A_EC_FORMAT3F","Entourer l'ombre du chat",null,"9ans","auto-questionnaire ecole","questionnaire enfant","","","","","","exercices de phonologie",""]
[null,null,null,"Entourer l'ombre de l'oiseau","VISUOIS","A09X_VISUOIS",null,null,"donnée","dico",null,"E9A_EC_FORMAT3F","Entourer l'ombre de l'oiseau",null,"9ans","auto-questionnaire ecole","questionnaire enfant","","","","","","exercices de phonologie",""]
[null,null,null,"Entourer l'ombre de la poire","VISUPOI","A09X_VISUPOI",null,null,"donnée","dico",null,"E9A_EC_FORMAT3F","Entourer l'ombre de la poire",null,"9ans","auto-questionnaire ecole","questionnaire enfant","","","","","","exercices de phonologie",""]
[null,null,null,"Entourer l'ombre de l'écureuil","VISUECU","A09X_VISUECU",null,null,"donnée","dico",null,"E9A_EC_FORMAT3F","Entourer l'ombre de l'écureuil",null,"9ans","auto-questionnaire ecole","questionnaire enfant","","","","","","exercices de compréhension écrite",""]
[null,null,null,"Entourer l'ombre du papillon","VISUPAP","A09X_VISUPAP",null,null,"donnée","dico",null,"E9A_EC_FORMAT3F","Entourer l'ombre du papillon",null,"9ans","auto-questionnaire ecole","questionnaire enfant","","","","","","exercices de compréhension écrite",""]
[null,null,null,"Comparer les sons des mots : silense silence","SILENCE_rc","A09X_SILENCE_rc",null,null,"donnée","dico",null,"E9A_MOTECRIS","Comparer les sons des mots : silense silence",null,"9ans","auto-questionnaire ecole","questionnaire enfant","","","","","","exercices de compréhension écrite",""]
[null,null,null,"Comparer les sons des mots : pulbic public","PUBLIC_rc","A09X_PUBLIC_rc",null,null,"donnée","dico",null,"E9A_MOTECRIS","Comparer les sons des mots : pulbic public",null,"9ans","auto-questionnaire ecole","questionnaire enfant","","","","","","exercices de compréhension écrite",""]
[null,null,null,"Comparer les sons des mots : erreur emeur","ERREUR_rc","A09X_ERREUR_rc",null,null,"donnée","dico",null,"E9A_MOTECRIS","Comparer les sons des mots : erreur emeur",null,"9ans","auto-questionnaire ecole","questionnaire enfant","","","","","","exercices de compréhension écrite",""]
[null,null,null,"Comparer les sons des mots : danger danjer","DANGER_rc","A09X_DANGER_rc",null,null,"donnée","dico",null,"E9A_MOTECRIS","Comparer les sons des mots : danger danjer",null,"9ans","auto-questionnaire ecole","questionnaire enfant","","","","","","exercices de compréhension écrite",""]
[null,null,null,"Comparer les sons des mots : dessin décin","DESSIN_rc","A09X_DESSIN_rc",null,null,"donnée","dico",null,"E9A_MOTECRIS","Comparer les sons des mots : dessin décin",null,"9ans","auto-questionnaire ecole","questionnaire enfant","","","","","","exercices de compréhension écrite",""]
[null,null,null,"Comparer les sons des mots : écrivain écrivin","ECRIVA_rc","A09X_ECRIVA_rc",null,null,"donnée","dico",null,"E9A_MOTECRIS","Comparer les sons des mots : écrivain écrivin",null,"9ans","auto-questionnaire ecole","questionnaire enfant","","","","","","exercices de compréhension écrite",""]
[null,null,null,"Comparer les sons des mots : bauté beauté","BEAUTE_rc","A09X_BEAUTE_rc",null,null,"donnée","dico",null,"E9A_MOTECRIS","Comparer les sons des mots : bauté beauté",null,"9ans","auto-questionnaire ecole","questionnaire enfant","","","","","","exercices de compréhension écrite",""]
[null,null,null,"Comparer les sons des mots : principal princifal","PRINCI_rc","A09X_PRINCI_rc",null,null,"donnée","dico",null,"E9A_MOTECRIS","Comparer les sons des mots : principal princifal",null,"9ans","auto-questionnaire ecole","questionnaire enfant","","","","","","exercices de compréhension écrite",""]
[null,null,null,"Comparer les sons des mots : naladie maladie","MALADI_rc","A09X_MALADI_rc",null,null,"donnée","dico",null,"E9A_MOTECRIS","Comparer les sons des mots : naladie maladie",null,"9ans","auto-questionnaire ecole","questionnaire enfant","","","","","","exercices de compréhension écrite",""]
[null,null,null,"Comparer les sons des mots : sauson saison","SAISON_rc","A09X_SAISON_rc",null,null,"donnée","dico",null,"E9A_MOTECRIS","Comparer les sons des mots : sauson saison",null,"9ans","auto-questionnaire ecole","questionnaire enfant","","","","","","exercices de compréhension écrite",""]
[null,null,null,"Comparer les sons des mots : fauteuil phauteuil","FAUTEUI_rc","A09X_FAUTEUI_rc",null,null,"donnée","dico",null,"E9A_MOTECRIS","Comparer les sons des mots : fauteuil phauteuil",null,"9ans","auto-questionnaire ecole","questionnaire enfant","","","","","","exercices de compréhension écrite",""]
[null,null,null,"Comparer les sons des mots : douceur dousseur","DOUCEU_rc","A09X_DOUCEU_rc",null,null,"donnée","dico",null,"E9A_MOTECRIS","Comparer les sons des mots : douceur dousseur",null,"9ans","auto-questionnaire ecole","questionnaire enfant","","","","","","exercices de compréhension écrite",""]
[null,null,null,"Comparer les sons des mots : enphant enfant","ENFANT_rc","A09X_ENFANT_rc",null,null,"donnée","dico",null,"E9A_MOTECRIS","Comparer les sons des mots : enphant enfant",null,"9ans","auto-questionnaire ecole","questionnaire enfant","","","","","","exercices de compréhension écrite",""]
[null,null,null,"Comparer les sons des mots : buran bureau","BUREAU_rc","A09X_BUREAU_rc",null,null,"donnée","dico",null,"E9A_MOTECRIS","Comparer les sons des mots : buran bureau",null,"9ans","auto-questionnaire ecole","questionnaire enfant","","","","","","exercices de compréhension écrite",""]
[null,null,null,"Comparer les sons des mots : rydeau rideau","RIDEAU_rc","A09X_RIDEAU_rc",null,null,"donnée","dico",null,"E9A_MOTECRIS","Comparer les sons des mots : rydeau rideau",null,"9ans","auto-questionnaire ecole","questionnaire enfant","","","","","","exercices de compréhension écrite",""]
[null,null,null,"Comparer les sons des mots : printemps printan","PRINTE_rc","A09X_PRINTE_rc",null,null,"donnée","dico",null,"E9A_MOTECRIS","Comparer les sons des mots : printemps printan",null,"9ans","auto-questionnaire ecole","questionnaire enfant","","","","","","exercices de compréhension écrite",""]
[null,null,null,"Comparer les sons des mots : voiture voibure","VOITUR_rc","A09X_VOITUR_rc",null,null,"donnée","dico",null,"E9A_MOTECRIS","Comparer les sons des mots : voiture voibure",null,"9ans","auto-questionnaire ecole","questionnaire enfant","","","","","","exercices de compréhension écrite",""]
[null,null,null,"Comparer les sons des mots : afitié amitié","AMITIE_rc","A09X_AMITIE_rc",null,null,"donnée","dico",null,"E9A_MOTECRIS","Comparer les sons des mots : afitié amitié",null,"9ans","auto-questionnaire ecole","questionnaire enfant","","","","","","exercices de compréhension écrite",""]
[null,null,null,"Comparer les sons des mots : noture nature","NATURE_rc","A09X_NATURE_rc",null,null,"donnée","dico",null,"E9A_MOTECRIS","Comparer les sons des mots : noture nature",null,"9ans","auto-questionnaire ecole","questionnaire enfant","","","","","","exercices de compréhension écrite",""]
[null,null,null,"Comparer les sons des mots : travail travaie","TRAVAI_rc","A09X_TRAVAI_rc",null,null,"donnée","dico",null,"E9A_MOTECRIS","Comparer les sons des mots : travail travaie",null,"9ans","auto-questionnaire ecole","questionnaire enfant","","","","","","exercices de lecture",""]
[null,null,null,"Comparer les sons des mots : jénéral général","GENERA_rc","A09X_GENERA_rc",null,null,"donnée","dico",null,"E9A_MOTECRIS","Comparer les sons des mots : jénéral général",null,"9ans","auto-questionnaire ecole","questionnaire enfant","","","","","","exercices de lecture",""]
[null,null,null,"Comparer les sons des mots : cousin cousain","COUSIN_rc","A09X_COUSIN_rc",null,null,"donnée","dico",null,"E9A_MOTECRIS","Comparer les sons des mots : cousin cousain",null,"9ans","auto-questionnaire ecole","questionnaire enfant","","","","","","exercices de lecture",""]
[null,null,null,"Comparer les sons des mots : dergé degré","DEGRE_rc","A09X_DEGRE_rc",null,null,"donnée","dico",null,"E9A_MOTECRIS","Comparer les sons des mots : dergé degré",null,"9ans","auto-questionnaire ecole","questionnaire enfant","","","","","","exercices de lecture",""]
[null,null,null,"Comparer les sons des mots : soleil soteil","SOLEIL_rc","A09X_SOLEIL_rc",null,null,"donnée","dico",null,"E9A_MOTECRIS","Comparer les sons des mots : soleil soteil",null,"9ans","auto-questionnaire ecole","questionnaire enfant","","","","","","exercices de lecture",""]
[null,null,null,"Comparer les sons des mots : maizon maison","MAISON_rc","A09X_MAISON_rc",null,null,"donnée","dico",null,"E9A_MOTECRIS","Comparer les sons des mots : maizon maison",null,"9ans","auto-questionnaire ecole","questionnaire enfant","","","","","","exercices de lecture",""]
[null,null,null,"Comparer les sons des mots : calut salut","SALUT_rc","A09X_SALUT_rc",null,null,"donnée","dico",null,"E9A_MOTECRIS","Comparer les sons des mots : calut salut",null,"9ans","auto-questionnaire ecole","questionnaire enfant","","","","","","exercices de lecture",""]
[null,null,null,"Comparer les sons des mots : doctour docteur","DOCTEUR_rc","A09X_DOCTEUR_rc",null,null,"donnée","dico",null,"E9A_MOTECRIS","Comparer les sons des mots : doctour docteur",null,"9ans","auto-questionnaire ecole","questionnaire enfant","","","","","","exercices de lecture",""]
[null,null,null,"Comparer les sons des mots : morpeau morceau","MORCEA_rc","A09X_MORCEA_rc",null,null,"donnée","dico",null,"E9A_MOTECRIS","Comparer les sons des mots : morpeau morceau",null,"9ans","auto-questionnaire ecole","questionnaire enfant","","","","","","exercices de lecture",""]
[null,null,null,"Comparer les sons des mots : mersi merci","MERCI_rc","A09X_MERCI_rc",null,null,"donnée","dico",null,"E9A_MOTECRIS","Comparer les sons des mots : mersi merci",null,"9ans","auto-questionnaire ecole","questionnaire enfant","","","","","","exercices de lecture",""]
[null,null,null,"Comparer les sons des mots : hubeur humeur","HUMEUR_rc","A09X_HUMEUR_rc",null,null,"donnée","dico",null,"E9A_MOTECRIS","Comparer les sons des mots : hubeur humeur",null,"9ans","auto-questionnaire ecole","questionnaire enfant","","","","","","exercices de lecture",""]
[null,null,null,"Comparer les sons des mots : chatou château","CHATEA_rc","A09X_CHATEA_rc",null,null,"donnée","dico",null,"E9A_MOTECRIS","Comparer les sons des mots : chatou château",null,"9ans","auto-questionnaire ecole","questionnaire enfant","","","","","","exercices de lecture",""]
[null,null,null,"Comparer les sons des mots : animal anifal","ANIMAL_rc","A09X_ANIMAL_rc",null,null,"donnée","dico",null,"E9A_MOTECRIS","Comparer les sons des mots : animal anifal",null,"9ans","auto-questionnaire ecole","questionnaire enfant","","","","","","exercices de lecture",""]
[null,null,null,"Comparer les sons des mots : source sourse","SOURCE_rc","A09X_SOURCE_rc",null,null,"donnée","dico",null,"E9A_MOTECRIS","Comparer les sons des mots : source sourse",null,"9ans","auto-questionnaire ecole","questionnaire enfant","","","","","","exercices de lecture",""]
[null,null,null,"Comparer les sons des mots : limerté liberté","LIBERT_rc","A09X_LIBERT_rc",null,null,"donnée","dico",null,"E9A_MOTECRIS","Comparer les sons des mots : limerté liberté",null,"9ans","auto-questionnaire ecole","questionnaire enfant","","","","","","mesure de l'estime de soi",""]
[null,null,null,"Comparer les sons des mots : gournal journal","JOURNA_rc","A09X_JOURNA_rc",null,null,"donnée","dico",null,"E9A_MOTECRIS","Comparer les sons des mots : gournal journal",null,"9ans","auto-questionnaire ecole","questionnaire enfant","","","","","","mesure de l'estime de soi",""]
[null,null,null,"Comparer les sons des mots : novembre novambre","NOVEMB_rc","A09X_NOVEMB_rc",null,null,"donnée","dico",null,"E9A_MOTECRIS","Comparer les sons des mots : novembre novambre",null,"9ans","auto-questionnaire ecole","questionnaire enfant","","","","","","mesure de l'estime de soi",""]
[null,null,null,"Comparer les sons des mots : image imache","IMAGE_rc","A09X_IMAGE_rc",null,null,"donnée","dico",null,"E9A_MOTECRIS","Comparer les sons des mots : image imache",null,"9ans","auto-questionnaire ecole","questionnaire enfant","","","","","","mesure de l'estime de soi",""]
[null,null,null,"Comparer les sons des mots : chipeau chapeau","CHAPEA_rc","A09X_CHAPEA_rc",null,null,"donnée","dico",null,"E9A_MOTECRIS","Comparer les sons des mots : chipeau chapeau",null,"9ans","auto-questionnaire ecole","questionnaire enfant","","","","","","mesure de l'estime de soi",""]
[null,null,null,"Comparer les sons des mots : siècle ciècle","SIECLE_rc","A09X_SIECLE_rc",null,null,"donnée","dico",null,"E9A_MOTECRIS","Comparer les sons des mots : siècle ciècle",null,"9ans","auto-questionnaire ecole","questionnaire enfant","","","","","","mesure de l'estime de soi",""]
[null,null,null,"Comparer les sons des mots : tableau talbeau","TABLEA_rc","A09X_TABLEA_rc",null,null,"donnée","dico",null,"E9A_MOTECRIS","Comparer les sons des mots : tableau talbeau",null,"9ans","auto-questionnaire ecole","questionnaire enfant","","","","","","mesure de l'estime de soi",""]
[null,null,null,"Comparer les sons des mots : silense silence","SILENCE","A09X_SILENCE",null,null,"donnée","float",null,null,"Comparer les sons des mots : silense silence",null,"9ans","auto-questionnaire ecole","questionnaire enfant","","","","","","exercices de compréhension écrite",""]
[null,null,null,"Comparer les sons des mots : pulbic public","PUBLIC","A09X_PUBLIC",null,null,"donnée","float",null,null,"Comparer les sons des mots : pulbic public",null,"9ans","auto-questionnaire ecole","questionnaire enfant","","","","","","exercices de compréhension écrite",""]
[null,null,null,"Comparer les sons des mots : erreur emeur","ERREUR","A09X_ERREUR",null,null,"donnée","float",null,null,"Comparer les sons des mots : erreur emeur",null,"9ans","auto-questionnaire ecole","questionnaire enfant","","","","","","exercices de compréhension écrite",""]
[null,null,null,"Comparer les sons des mots : danger danjer","DANGER","A09X_DANGER",null,null,"donnée","float",null,null,"Comparer les sons des mots : danger danjer",null,"9ans","auto-questionnaire ecole","questionnaire enfant","","","","","","exercices de compréhension écrite",""]
[null,null,null,"Comparer les sons des mots : dessin décin","DESSIN","A09X_DESSIN",null,null,"donnée","float",null,null,"Comparer les sons des mots : dessin décin",null,"9ans","auto-questionnaire ecole","questionnaire enfant","","","","","","exercices de compréhension écrite",""]
[null,null,null,"Comparer les sons des mots : écrivain écrivin","ECRIVA","A09X_ECRIVA",null,null,"donnée","float",null,null,"Comparer les sons des mots : écrivain écrivin",null,"9ans","auto-questionnaire ecole","questionnaire enfant","","","","","","exercices de compréhension écrite",""]
[null,null,null,"Comparer les sons des mots : bauté beauté","BEAUTE","A09X_BEAUTE",null,null,"donnée","float",null,null,"Comparer les sons des mots : bauté beauté",null,"9ans","auto-questionnaire ecole","questionnaire enfant","","","","","","exercices de compréhension écrite",""]
[null,null,null,"Comparer les sons des mots : principal princifal","PRINCI","A09X_PRINCI",null,null,"donnée","float",null,null,"Comparer les sons des mots : principal princifal",null,"9ans","auto-questionnaire ecole","questionnaire enfant","","","","","","exercices de compréhension écrite",""]
[null,null,null,"Comparer les sons des mots : naladie maladie","MALADI","A09X_MALADI",null,null,"donnée","float",null,null,"Comparer les sons des mots : naladie maladie",null,"9ans","auto-questionnaire ecole","questionnaire enfant","","","","","","exercices de compréhension écrite",""]
[null,null,null,"Comparer les sons des mots : sauson saison","SAISON","A09X_SAISON",null,null,"donnée","float",null,null,"Comparer les sons des mots : sauson saison",null,"9ans","auto-questionnaire ecole","questionnaire enfant","","","","","","exercices de compréhension écrite",""]
[null,null,null,"Comparer les sons des mots : fauteuil phauteuil","FAUTEUI","A09X_FAUTEUI",null,null,"donnée","float",null,null,"Comparer les sons des mots : fauteuil phauteuil",null,"9ans","auto-questionnaire ecole","questionnaire enfant","","","","","","exercices de compréhension écrite",""]
[null,null,null,"Comparer les sons des mots : douceur dousseur","DOUCEU","A09X_DOUCEU",null,null,"donnée","float",null,null,"Comparer les sons des mots : douceur dousseur",null,"9ans","auto-questionnaire ecole","questionnaire enfant","","","","","","exercices de compréhension écrite",""]
[null,null,null,"Comparer les sons des mots : enphant enfant","ENFANT","A09X_ENFANT",null,null,"donnée","float",null,null,"Comparer les sons des mots : enphant enfant",null,"9ans","auto-questionnaire ecole","questionnaire enfant","","","","","","exercices de compréhension écrite",""]
[null,null,null,"Comparer les sons des mots : buran bureau","BUREAU","A09X_BUREAU",null,null,"donnée","float",null,null,"Comparer les sons des mots : buran bureau",null,"9ans","auto-questionnaire ecole","questionnaire enfant","","","","","","exercices de compréhension écrite",""]
[null,null,null,"Comparer les sons des mots : rydeau rideau","RIDEAU","A09X_RIDEAU",null,null,"donnée","float",null,null,"Comparer les sons des mots : rydeau rideau",null,"9ans","auto-questionnaire ecole","questionnaire enfant","","","","","","exercices de compréhension écrite",""]
[null,null,null,"Comparer les sons des mots : printemps printan","PRINTE","A09X_PRINTE",null,null,"donnée","float",null,null,"Comparer les sons des mots : printemps printan",null,"9ans","auto-questionnaire ecole","questionnaire enfant","","","","","","exercices de compréhension écrite",""]
[null,null,null,"Comparer les sons des mots : voiture voibure","VOITUR","A09X_VOITUR",null,null,"donnée","float",null,null,"Comparer les sons des mots : voiture voibure",null,"9ans","auto-questionnaire ecole","questionnaire enfant","","","","","","exercices de compréhension écrite",""]
[null,null,null,"Comparer les sons des mots : afitié amitié","AMITIE","A09X_AMITIE",null,null,"donnée","float",null,null,"Comparer les sons des mots : afitié amitié",null,"9ans","auto-questionnaire ecole","questionnaire enfant","","","","","","exercices de compréhension écrite",""]
[null,null,null,"Comparer les sons des mots : noture nature","NATURE","A09X_NATURE",null,null,"donnée","float",null,null,"Comparer les sons des mots : noture nature",null,"9ans","auto-questionnaire ecole","questionnaire enfant","","","","","","exercices de compréhension écrite",""]
[null,null,null,"Comparer les sons des mots : travail travaie","TRAVAI","A09X_TRAVAI",null,null,"donnée","float",null,null,"Comparer les sons des mots : travail travaie",null,"9ans","auto-questionnaire ecole","questionnaire enfant","","","","","","exercices de lecture",""]
[null,null,null,"Comparer les sons des mots : jénéral général","GENERA","A09X_GENERA",null,null,"donnée","float",null,null,"Comparer les sons des mots : jénéral général",null,"9ans","auto-questionnaire ecole","questionnaire enfant","","","","","","exercices de lecture",""]
[null,null,null,"Comparer les sons des mots : cousin cousain","COUSIN","A09X_COUSIN",null,null,"donnée","float",null,null,"Comparer les sons des mots : cousin cousain",null,"9ans","auto-questionnaire ecole","questionnaire enfant","","","","","","exercices de lecture",""]
[null,null,null,"Comparer les sons des mots : dergé degré","DEGRE","A09X_DEGRE",null,null,"donnée","float",null,null,"Comparer les sons des mots : dergé degré",null,"9ans","auto-questionnaire ecole","questionnaire enfant","","","","","","exercices de lecture",""]
[null,null,null,"Comparer les sons des mots : soleil soteil","SOLEIL","A09X_SOLEIL",null,null,"donnée","float",null,null,"Comparer les sons des mots : soleil soteil",null,"9ans","auto-questionnaire ecole","questionnaire enfant","","","","","","exercices de lecture",""]
[null,null,null,"Comparer les sons des mots : maizon maison","MAISON","A09X_MAISON",null,null,"donnée","float",null,null,"Comparer les sons des mots : maizon maison",null,"9ans","auto-questionnaire ecole","questionnaire enfant","","","","","","exercices de lecture",""]
[null,null,null,"Comparer les sons des mots : calut salut","SALUT","A09X_SALUT",null,null,"donnée","float",null,null,"Comparer les sons des mots : calut salut",null,"9ans","auto-questionnaire ecole","questionnaire enfant","","","","","","exercices de lecture",""]
[null,null,null,"Comparer les sons des mots : doctour docteur","DOCTEUR","A09X_DOCTEUR",null,null,"donnée","float",null,null,"Comparer les sons des mots : doctour docteur",null,"9ans","auto-questionnaire ecole","questionnaire enfant","","","","","","exercices de lecture",""]
[null,null,null,"Comparer les sons des mots : morpeau morceau","MORCEA","A09X_MORCEA",null,null,"donnée","float",null,null,"Comparer les sons des mots : morpeau morceau",null,"9ans","auto-questionnaire ecole","questionnaire enfant","","","","","","exercices de lecture",""]
[null,null,null,"Comparer les sons des mots : mersi merci","MERCI","A09X_MERCI",null,null,"donnée","float",null,null,"Comparer les sons des mots : mersi merci",null,"9ans","auto-questionnaire ecole","questionnaire enfant","","","","","","exercices de lecture",""]
[null,null,null,"Comparer les sons des mots : hubeur humeur","HUMEUR","A09X_HUMEUR",null,null,"donnée","float",null,null,"Comparer les sons des mots : hubeur humeur",null,"9ans","auto-questionnaire ecole","questionnaire enfant","","","","","","exercices de lecture",""]
[null,null,null,"Comparer les sons des mots : chatou château","CHATEA","A09X_CHATEA",null,null,"donnée","float",null,null,"Comparer les sons des mots : chatou château",null,"9ans","auto-questionnaire ecole","questionnaire enfant","","","","","","exercices de lecture",""]
[null,null,null,"Comparer les sons des mots : animal anifal","ANIMAL","A09X_ANIMAL",null,null,"donnée","float",null,null,"Comparer les sons des mots : animal anifal",null,"9ans","auto-questionnaire ecole","questionnaire enfant","","","","","","exercices de lecture",""]
[null,null,null,"Comparer les sons des mots : source sourse","SOURCE","A09X_SOURCE",null,null,"donnée","float",null,null,"Comparer les sons des mots : source sourse",null,"9ans","auto-questionnaire ecole","questionnaire enfant","","","","","","exercices de lecture",""]
[null,null,null,"Comparer les sons des mots : limerté liberté","LIBERT","A09X_LIBERT",null,null,"donnée","float",null,null,"Comparer les sons des mots : limerté liberté",null,"9ans","auto-questionnaire ecole","questionnaire enfant","","","","","","mesure de l'estime de soi",""]
[null,null,null,"Comparer les sons des mots : gournal journal","JOURNA","A09X_JOURNA",null,null,"donnée","float",null,null,"Comparer les sons des mots : gournal journal",null,"9ans","auto-questionnaire ecole","questionnaire enfant","","","","","","mesure de l'estime de soi",""]
[null,null,null,"Comparer les sons des mots : novembre novambre","NOVEMB","A09X_NOVEMB",null,null,"donnée","float",null,null,"Comparer les sons des mots : novembre novambre",null,"9ans","auto-questionnaire ecole","questionnaire enfant","","","","","","mesure de l'estime de soi",""]
[null,null,null,"Comparer les sons des mots : image imache","IMAGE","A09X_IMAGE",null,null,"donnée","float",null,null,"Comparer les sons des mots : image imache",null,"9ans","auto-questionnaire ecole","questionnaire enfant","","","","","","mesure de l'estime de soi",""]
[null,null,null,"Comparer les sons des mots : chipeau chapeau","CHAPEA","A09X_CHAPEA",null,null,"donnée","float",null,null,"Comparer les sons des mots : chipeau chapeau",null,"9ans","auto-questionnaire ecole","questionnaire enfant","","","","","","mesure de l'estime de soi",""]
[null,null,null,"Comparer les sons des mots : siècle ciècle","SIECLE","A09X_SIECLE",null,null,"donnée","float",null,null,"Comparer les sons des mots : siècle ciècle",null,"9ans","auto-questionnaire ecole","questionnaire enfant","","","","","","mesure de l'estime de soi",""]
[null,null,null,"Comparer les sons des mots : tableau talbeau","TABLEA","A09X_TABLEA",null,null,"donnée","float",null,null,"Comparer les sons des mots : tableau talbeau",null,"9ans","auto-questionnaire ecole","questionnaire enfant","","","","","","mesure de l'estime de soi",""]
[null,null,null,"Comparer la signification des phrases : Le garçon bondit. L’enfant saute","MOTGAR_rc","A09X_MOTGAR_rc",null,null,"donnée","dico",null,"E9A_COMPORAL","Comparer la signification des phrases : Le garçon bondit. L’enfant saute",null,"9ans","auto-questionnaire ecole","questionnaire enfant",null,null,null,null,null,"exercices de compréhension orale"]
[null,null,null,"Comparer la signification des phrases : L’escargot n’est ni rapide, ni bruyant. L’escargot est lent mais pas bruyant","MOTESC_rc","A09X_MOTESC_rc",null,null,"donnée","dico",null,"E9A_COMPORAL","Comparer la signification des phrases : L’escargot n’est ni rapide, ni bruyant. L’escargot est lent mais pas bruyant",null,"9ans","auto-questionnaire ecole","questionnaire enfant",null,null,null,null,null,"exercices de compréhension orale"]
[null,null,null,"Comparer la signification des phrases : Le couteau est plus long que le crayon. Le crayon est plus long que le couteau","MOTCOU_rc","A09X_MOTCOU_rc",null,null,"donnée","dico",null,"E9A_COMPORAL","Comparer la signification des phrases : Le couteau est plus long que le crayon. Le crayon est plus long que le couteau",null,"9ans","auto-questionnaire ecole","questionnaire enfant",null,null,null,null,null,"exercices de compréhension orale"]
[null,null,null,"Comparer la signification des phrases : Le bocal dans lequel est la boîte est solide. La boîte est dans le bocal solide","MOTBOC_rc","A09X_MOTBOC_rc",null,null,"donnée","dico",null,"E9A_COMPORAL","Comparer la signification des phrases : Le bocal dans lequel est la boîte est solide. La boîte est dans le bocal solide",null,"9ans","auto-questionnaire ecole","questionnaire enfant",null,null,null,null,null,"exercices de compréhension orale"]
[null,null,null,"Comparer la signification des phrases : Les insectes volent. Les avions décollent","MOTINS_rc","A09X_MOTINS_rc",null,null,"donnée","dico",null,"E9A_COMPORAL","Comparer la signification des phrases : Les insectes volent. Les avions décollent",null,"9ans","auto-questionnaire ecole","questionnaire enfant",null,null,null,null,null,"exercices de compréhension orale"]
[null,null,null,"Comparer la signification des phrases : Le moustique se trouve sous le rideau. Le moustique se trouve au-dessus du rideau","MOTRID_rc","A09X_MOTRID_rc",null,null,"donnée","dico",null,"E9A_COMPORAL","Comparer la signification des phrases : Le moustique se trouve sous le rideau. Le moustique se trouve au-dessus du rideau",null,"9ans","auto-questionnaire ecole","questionnaire enfant",null,null,null,null,null,"exercices de compréhension orale"]
[null,null,null,"Comparer la signification des phrases : Le mouchoir est dans sa poche. Le mouchoir est à l’intérieur de sa poche","MOTPOC_rc","A09X_MOTPOC_rc",null,null,"donnée","dico",null,"E9A_COMPORAL","Comparer la signification des phrases : Le mouchoir est dans sa poche. Le mouchoir est à l’intérieur de sa poche",null,"9ans","auto-questionnaire ecole","questionnaire enfant",null,null,null,null,null,"exercices de compréhension orale"]
[null,null,null,"Comparer la signification des phrases : Il mange seulement des gâteaux. Il ne mange plus de gâteaux","MOTMAN_rc","A09X_MOTMAN_rc",null,null,"donnée","dico",null,"E9A_COMPORAL","Comparer la signification des phrases : Il mange seulement des gâteaux. Il ne mange plus de gâteaux",null,"9ans","auto-questionnaire ecole","questionnaire enfant",null,null,null,null,null,"exercices de compréhension orale"]
[null,null,null,"Comparer la signification des phrases : Le chat dont les yeux sont verts regarde la dame. Le chat regarde la dame aux yeux verts","MOTCHA_rc","A09X_MOTCHA_rc",null,null,"donnée","dico",null,"E9A_COMPORAL","Comparer la signification des phrases : Le chat dont les yeux sont verts regarde la dame. Le chat regarde la dame aux yeux verts",null,"9ans","auto-questionnaire ecole","questionnaire enfant",null,null,null,null,null,"exercices de compréhension orale"]
[null,null,null,"Comparer la signification des phrases : Le planeur qui survole la péniche tangue. Le planeur survole la péniche et tangue","MOTPLA_rc","A09X_MOTPLA_rc",null,null,"donnée","dico",null,"E9A_COMPORAL","Comparer la signification des phrases : Le planeur qui survole la péniche tangue. Le planeur survole la péniche et tangue",null,"9ans","auto-questionnaire ecole","questionnaire enfant",null,null,null,null,null,"exercices de compréhension orale"]
[null,null,null,"Comparer la signification des phrases : La fille poursuit le chien qui saute. La fille poursuit le chien et saute","MOTFIL_rc","A09X_MOTFIL_rc",null,null,"donnée","dico",null,"E9A_COMPORAL","Comparer la signification des phrases : La fille poursuit le chien qui saute. La fille poursuit le chien et saute",null,"9ans","auto-questionnaire ecole","questionnaire enfant",null,null,null,null,null,"exercices de compréhension orale"]
[null,null,null,"Comparer la signification des phrases : Le cuisinier achète une brioche. Il mange la brioche","MOTCUI_rc","A09X_MOTCUI_rc",null,null,"donnée","dico",null,"E9A_COMPORAL","Comparer la signification des phrases : Le cuisinier achète une brioche. Il mange la brioche",null,"9ans","auto-questionnaire ecole","questionnaire enfant",null,null,null,null,null,"exercices de compréhension orale"]
[null,null,null,"Comparer la signification des phrases : Le garçon bondit. L’enfant saute","MOTGAR","A09X_MOTGAR",null,null,"donnée","float",null,null,"Comparer la signification des phrases : Le garçon bondit. L’enfant saute",null,"9ans","auto-questionnaire ecole","questionnaire enfant",null,null,null,null,null,"exercices de compréhension orale"]
[null,null,null,"Comparer la signification des phrases : L’escargot n’est ni rapide, ni bruyant. L’escargot est lent mais pas bruyant","MOTESC","A09X_MOTESC",null,null,"donnée","float",null,null,"Comparer la signification des phrases : L’escargot n’est ni rapide, ni bruyant. L’escargot est lent mais pas bruyant",null,"9ans","auto-questionnaire ecole","questionnaire enfant",null,null,null,null,null,"exercices de compréhension orale"]
[null,null,null,"Comparer la signification des phrases : Le couteau est plus long que le crayon. Le crayon est plus long que le couteau","MOTCOU","A09X_MOTCOU",null,null,"donnée","float",null,null,"Comparer la signification des phrases : Le couteau est plus long que le crayon. Le crayon est plus long que le couteau",null,"9ans","auto-questionnaire ecole","questionnaire enfant",null,null,null,null,null,"exercices de compréhension orale"]
[null,null,null,"Comparer la signification des phrases : Le bocal dans lequel est la boîte est solide. La boîte est dans le bocal solide","MOTBOC","A09X_MOTBOC",null,null,"donnée","float",null,null,"Comparer la signification des phrases : Le bocal dans lequel est la boîte est solide. La boîte est dans le bocal solide",null,"9ans","auto-questionnaire ecole","questionnaire enfant",null,null,null,null,null,"exercices de compréhension orale"]
[null,null,null,"Comparer la signification des phrases : Les insectes volent. Les avions décollent","MOTINS","A09X_MOTINS",null,null,"donnée","float",null,null,"Comparer la signification des phrases : Les insectes volent. Les avions décollent",null,"9ans","auto-questionnaire ecole","questionnaire enfant",null,null,null,null,null,"exercices de compréhension orale"]
[null,null,null,"Comparer la signification des phrases : Le moustique se trouve sous le rideau. Le moustique se trouve au-dessus du rideau","MOTRID","A09X_MOTRID",null,null,"donnée","float",null,null,"Comparer la signification des phrases : Le moustique se trouve sous le rideau. Le moustique se trouve au-dessus du rideau",null,"9ans","auto-questionnaire ecole","questionnaire enfant",null,null,null,null,null,"exercices de compréhension orale"]
[null,null,null,"Comparer la signification des phrases : Le mouchoir est dans sa poche. Le mouchoir est à l’intérieur de sa poche","MOTPOC","A09X_MOTPOC",null,null,"donnée","float",null,null,"Comparer la signification des phrases : Le mouchoir est dans sa poche. Le mouchoir est à l’intérieur de sa poche",null,"9ans","auto-questionnaire ecole","questionnaire enfant",null,null,null,null,null,"exercices de compréhension orale"]
[null,null,null,"Comparer la signification des phrases : Il mange seulement des gâteaux. Il ne mange plus de gâteaux","MOTMAN","A09X_MOTMAN",null,null,"donnée","float",null,null,"Comparer la signification des phrases : Il mange seulement des gâteaux. Il ne mange plus de gâteaux",null,"9ans","auto-questionnaire ecole","questionnaire enfant",null,null,null,null,null,"exercices de compréhension orale"]
[null,null,null,"Comparer la signification des phrases : Le chat dont les yeux sont verts regarde la dame. Le chat regarde la dame aux yeux verts","MOTCHA","A09X_MOTCHA",null,null,"donnée","float",null,null,"Comparer la signification des phrases : Le chat dont les yeux sont verts regarde la dame. Le chat regarde la dame aux yeux verts",null,"9ans","auto-questionnaire ecole","questionnaire enfant",null,null,null,null,null,"exercices de compréhension orale"]
[null,null,null,"Comparer la signification des phrases : Le planeur qui survole la péniche tangue. Le planeur survole la péniche et tangue","MOTPLA","A09X_MOTPLA",null,null,"donnée","float",null,null,"Comparer la signification des phrases : Le planeur qui survole la péniche tangue. Le planeur survole la péniche et tangue",null,"9ans","auto-questionnaire ecole","questionnaire enfant",null,null,null,null,null,"exercices de compréhension orale"]
[null,null,null,"Comparer la signification des phrases : La fille poursuit le chien qui saute. La fille poursuit le chien et saute","MOTFIL","A09X_MOTFIL",null,null,"donnée","float",null,null,"Comparer la signification des phrases : La fille poursuit le chien qui saute. La fille poursuit le chien et saute",null,"9ans","auto-questionnaire ecole","questionnaire enfant",null,null,null,null,null,"exercices de compréhension orale"]
[null,null,null,"Comparer la signification des phrases : Le cuisinier achète une brioche. Il mange la brioche","MOTCUI","A09X_MOTCUI",null,null,"donnée","float",null,null,"Comparer la signification des phrases : Le cuisinier achète une brioche. Il mange la brioche",null,"9ans","auto-questionnaire ecole","questionnaire enfant",null,null,null,null,null,"exercices de compréhension orale"]
[null,null,null,"Quel temps fait-il au début de l’histoire","FRAIS_rc","A09X_FRAIS_rc",null,null,"donnée","dico",null,"E9A_COMPECRIT","Compréhension écrite : Quel temps fait-il au début de l’histoire",null,"9ans","auto-questionnaire ecole","questionnaire enfant",null,null,null,null,null,"exercices de compréhension écrite"]
[null,null,null,"Qu’est-ce qui surgit soudain sur la route","BICHE1_rc","A09X_BICHE1_rc",null,null,"donnée","dico",null,"E9A_COMPECRIT","Compréhension écrite : Qui s’arrête au milieu de la route",null,"9ans","auto-questionnaire ecole","questionnaire enfant",null,null,null,null,null,"exercices de compréhension écrite"]
[null,null,null,"Avec quel type de véhicule Guillaume roule-t-il au  début de l’histoire","MOTO_rc","A09X_MOTO_rc",null,null,"donnée","dico",null,"E9A_COMPECRIT","Compréhension écrite : Avec quel type de véhicule Guillaume roule-t-il au  début de l’histoire",null,"9ans","auto-questionnaire ecole","questionnaire enfant",null,null,null,null,null,"exercices de compréhension écrite"]
[null,null,null,"Où Guillaume va-t-il passer le weekend","CAMPAG_rc","A09X_CAMPAG_rc",null,null,"donnée","dico",null,"E9A_COMPECRIT","Compréhension écrite : Où Guillaume va-t-il passer le weekend",null,"9ans","auto-questionnaire ecole","questionnaire enfant",null,null,null,null,null,"exercices de compréhension écrite"]
[null,null,null,"Qu’avale Guillaume à la fin de l’histoire","COMPRI_rc","A09X_COMPRI_rc",null,null,"donnée","dico",null,"E9A_COMPECRIT","Compréhension écrite : Qu’avale Guillaume à la fin de l’histoire",null,"9ans","auto-questionnaire ecole","questionnaire enfant",null,null,null,null,null,"exercices de compréhension écrite"]
[null,null,null,"Sur quelle pédale Guillaume appuie-t-il de toutes ses forces","FREIN_rc","A09X_FREIN_rc",null,null,"donnée","dico",null,"E9A_COMPECRIT","Compréhension écrite : Sur quelle pédale Guillaume appuie-t-il de toutes ses forces",null,"9ans","auto-questionnaire ecole","questionnaire enfant",null,null,null,null,null,"exercices de compréhension écrite"]
[null,null,null,"Qu’est-il arrivé à Guillaume","HEURTE_rc","A09X_HEURTE_rc",null,null,"donnée","dico",null,"E9A_COMPECRIT","Compréhension écrite : Qu’est-il arrivé à Guillaume",null,"9ans","auto-questionnaire ecole","questionnaire enfant",null,null,null,null,null,"exercices de compréhension écrite"]
[null,null,null,"Où se trouve Guillaume à la fin de l’histoire","HOPITA_rc","A09X_HOPITA_rc",null,null,"donnée","dico",null,"E9A_COMPECRIT","Compréhension écrite : Où se trouve Guillaume à la fin de l’histoire",null,"9ans","auto-questionnaire ecole","questionnaire enfant",null,null,null,null,null,"exercices de compréhension écrite"]
[null,null,null,"Qui s’arrête au milieu de la route","BICHE2_rc","A09X_BICHE2_rc",null,null,"donnée","dico",null,"E9A_COMPECRIT","Compréhension écrite : Qui s’arrête au milieu de la route",null,"9ans","auto-questionnaire ecole","questionnaire enfant",null,null,null,null,null,"exercices de compréhension écrite"]
[null,null,null,"Pourquoi Guillaume s’endort-il","DROGUE_rc","A09X_DROGUE_rc",null,null,"donnée","dico",null,"E9A_COMPECRIT","Compréhension écrite : Pourquoi Guillaume s’endort-il",null,"9ans","auto-questionnaire ecole","questionnaire enfant",null,null,null,null,null,"exercices de compréhension écrite"]
[null,null,null,"Qui est la jeune femme à la fin de l’histoire","INFIRM_rc","A09X_INFIRM_rc",null,null,"donnée","dico",null,"E9A_COMPECRIT","Compréhension écrite : Qui est la jeune femme à la fin de l’histoire",null,"9ans","auto-questionnaire ecole","questionnaire enfant",null,null,null,null,null,"exercices de compréhension écrite"]
[null,null,null,"Pourquoi Guillaume a-t-il un œil douloureux","ACCIDE_rc","A09X_ACCIDE_rc",null,null,"donnée","dico",null,"E9A_COMPECRIT","Compréhension écrite : Pourquoi Guillaume a-t-il un œil douloureux",null,"9ans","auto-questionnaire ecole","questionnaire enfant",null,null,null,null,null,"exercices de compréhension écrite"]
[null,null,null,"Quel temps fait-il au début de l’histoire","FRAIS","A09X_FRAIS",null,null,"donnée","float",null,null,"Compréhension écrite : Quel temps fait-il au début de l’histoire",null,"9ans","auto-questionnaire ecole","questionnaire enfant",null,null,null,null,null,"exercices de compréhension écrite"]
[null,null,null,"Qu’est-ce qui surgit soudain sur la route","BICHE1","A09X_BICHE1",null,null,"donnée","float",null,null,"Compréhension écrite : Qui s’arrête au milieu de la route",null,"9ans","auto-questionnaire ecole","questionnaire enfant",null,null,null,null,null,"exercices de compréhension écrite"]
[null,null,null,"Avec quel type de véhicule Guillaume roule-t-il au  début de l’histoire","MOTO","A09X_MOTO",null,null,"donnée","float",null,null,"Compréhension écrite : Avec quel type de véhicule Guillaume roule-t-il au  début de l’histoire",null,"9ans","auto-questionnaire ecole","questionnaire enfant",null,null,null,null,null,"exercices de compréhension écrite"]
[null,null,null,"Où Guillaume va-t-il passer le weekend","CAMPAG","A09X_CAMPAG",null,null,"donnée","float",null,null,"Compréhension écrite : Où Guillaume va-t-il passer le weekend",null,"9ans","auto-questionnaire ecole","questionnaire enfant",null,null,null,null,null,"exercices de compréhension écrite"]
[null,null,null,"Qu’avale Guillaume à la fin de l’histoire","COMPRI","A09X_COMPRI",null,null,"donnée","float",null,null,"Compréhension écrite : Qu’avale Guillaume à la fin de l’histoire",null,"9ans","auto-questionnaire ecole","questionnaire enfant",null,null,null,null,null,"exercices de compréhension écrite"]
[null,null,null,"Sur quelle pédale Guillaume appuie-t-il de toutes ses forces","FREIN","A09X_FREIN",null,null,"donnée","float",null,null,"Compréhension écrite : Sur quelle pédale Guillaume appuie-t-il de toutes ses forces",null,"9ans","auto-questionnaire ecole","questionnaire enfant",null,null,null,null,null,"exercices de compréhension écrite"]
[null,null,null,"Qu’est-il arrivé à Guillaume","HEURTE","A09X_HEURTE",null,null,"donnée","float",null,null,"Compréhension écrite : Qu’est-il arrivé à Guillaume",null,"9ans","auto-questionnaire ecole","questionnaire enfant",null,null,null,null,null,"exercices de compréhension écrite"]
[null,null,null,"Où se trouve Guillaume à la fin de l’histoire","HOPITA","A09X_HOPITA",null,null,"donnée","float",null,null,"Compréhension écrite : Où se trouve Guillaume à la fin de l’histoire",null,"9ans","auto-questionnaire ecole","questionnaire enfant",null,null,null,null,null,"exercices de compréhension écrite"]
[null,null,null,"Qui s’arrête au milieu de la route","BICHE2","A09X_BICHE2",null,null,"donnée","float",null,null,"Compréhension écrite : Qui s’arrête au milieu de la route",null,"9ans","auto-questionnaire ecole","questionnaire enfant",null,null,null,null,null,"exercices de compréhension écrite"]
[null,null,null,"Pourquoi Guillaume s’endort-il","DROGUE","A09X_DROGUE",null,null,"donnée","float",null,null,"Compréhension écrite : Pourquoi Guillaume s’endort-il",null,"9ans","auto-questionnaire ecole","questionnaire enfant",null,null,null,null,null,"exercices de compréhension écrite"]
[null,null,null,"Qui est la jeune femme à la fin de l’histoire","INFIRM","A09X_INFIRM",null,null,"donnée","float",null,null,"Compréhension écrite : Qui est la jeune femme à la fin de l’histoire",null,"9ans","auto-questionnaire ecole","questionnaire enfant",null,null,null,null,null,"exercices de compréhension écrite"]
[null,null,null,"Pourquoi Guillaume a-t-il un œil douloureux","ACCIDE","A09X_ACCIDE",null,null,"donnée","float",null,null,"Compréhension écrite : Pourquoi Guillaume a-t-il un œil douloureux",null,"9ans","auto-questionnaire ecole","questionnaire enfant",null,null,null,null,null,"exercices de compréhension écrite"]
[null,null,null,"Aura","AURA_rc","A09X_AURA_rc",null,null,"donnée","dico",null,"E9A_EC_FORMAT4F","Orthographier un verbe au futur : Aura",null,"9ans","auto-questionnaire ecole","questionnaire enfant",null,null,null,null,null,"exercice de conjugaison"]
[null,null,null,"Ira","IRA_rc","A09X_IRA_rc",null,null,"donnée","dico",null,"E9A_EC_FORMAT4F","Orthographier un verbe au futur : Ira",null,"9ans","auto-questionnaire ecole","questionnaire enfant",null,null,null,null,null,"exercice de conjugaison"]
[null,null,null,"Apprendra","APPREN_rc","A09X_APPREN_rc",null,null,"donnée","dico",null,"E9A_EC_FORMAT4F","Orthographier un verbe au futur : Apprendra",null,"9ans","auto-questionnaire ecole","questionnaire enfant",null,null,null,null,null,"exercice de conjugaison"]
[null,null,null,"Sauront","SAURONT_rc","A09X_SAURONT_rc",null,null,"donnée","dico",null,"E9A_EC_FORMAT4F","Orthographier un verbe au futur : Sauront",null,"9ans","auto-questionnaire ecole","questionnaire enfant",null,null,null,null,null,"exercice de conjugaison"]
[null,null,null,"Seront","SERONT_rc","A09X_SERONT_rc",null,null,"donnée","dico",null,"E9A_EC_FORMAT4F","Orthographier un verbe au futur : Seront",null,"9ans","auto-questionnaire ecole","questionnaire enfant",null,null,null,null,null,"exercice de conjugaison"]
[null,null,null,"Aura","AURA","A09X_AURA",null,null,"donnée","float",null,null,"Orthographier un verbe au futur : Aura",null,"9ans","auto-questionnaire ecole","questionnaire enfant",null,null,null,null,null,"exercice de conjugaison"]
[null,null,null,"Ira","IRA","A09X_IRA",null,null,"donnée","float",null,null,"Orthographier un verbe au futur : Ira",null,"9ans","auto-questionnaire ecole","questionnaire enfant",null,null,null,null,null,"exercice de conjugaison"]
[null,null,null,"Apprendra","APPREN","A09X_APPREN",null,null,"donnée","float",null,null,"Orthographier un verbe au futur : Apprendra",null,"9ans","auto-questionnaire ecole","questionnaire enfant",null,null,null,null,null,"exercice de conjugaison"]
[null,null,null,"Sauront","SAURONT","A09X_SAURONT",null,null,"donnée","float",null,null,"Orthographier un verbe au futur : Sauront",null,"9ans","auto-questionnaire ecole","questionnaire enfant",null,null,null,null,null,"exercice de conjugaison"]
[null,null,null,"Seront","SERONT","A09X_SERONT",null,null,"donnée","float",null,null,"Orthographier un verbe au futur : Seront",null,"9ans","auto-questionnaire ecole","questionnaire enfant",null,null,null,null,null,"exercice de conjugaison"]
[null,null,null,"Les hérissons entrent ","TRENT_rc","A09X_TRENT_rc",null,null,"donnée","dico",null,"E9A_EC_FORMAT4F","Conjuguer un verbe à l'indicatif présent troisième personne du pluriel : Les hérissons entrent ",null,"9ans","auto-questionnaire ecole","questionnaire enfant",null,null,null,null,null,"exercice de conjugaison"]
[null,null,null,"Auparavant, ils","ILS_rc","A09X_ILS_rc",null,null,"donnée","dico",null,"E9A_EC_FORMAT4F","Conjuguer un verbe à l'indicatif présent à la troisième personne du pluriel : Auparavant, ils",null,"9ans","auto-questionnaire ecole","questionnaire enfant",null,null,null,null,null,"exercice de conjugaison"]
[null,null,null,"Ils mangent comme quatre","GENT_rc","A09X_GENT_rc",null,null,"donnée","dico",null,"E9A_EC_FORMAT4F","Conjuguer un verbe à l'indicatif présent à la troisième personne du pluriel : Ils mangent comme quatre",null,"9ans","auto-questionnaire ecole","questionnaire enfant",null,null,null,null,null,"exercice de conjugaison"]
[null,null,null,"Les jeunes","JEUNES_rc","A09X_JEUNES_rc",null,null,"donnée","dico",null,"E9A_EC_FORMAT4F","Conjuguer un verbe à l'indicatif présent à la troisième personne du pluriel : Les jeunes",null,"9ans","auto-questionnaire ecole","questionnaire enfant",null,null,null,null,null,"exercice de conjugaison"]
[null,null,null,"Les jeunes hérissons","RISSONS_rc","A09X_RISSONS_rc",null,null,"donnée","dico",null,"E9A_EC_FORMAT4F","Conjuguer un verbe à l'indicatif présent à la troisième personne du pluriel : Les jeunes hérissons",null,"9ans","auto-questionnaire ecole","questionnaire enfant",null,null,null,null,null,"exercice de conjugaison"]
[null,null,null,"Les jeunes hérissons sont","SONT_rc","A09X_SONT_rc",null,null,"donnée","dico",null,"E9A_EC_FORMAT4F","Conjuguer un verbe à l'indicatif présent à la troisième personne du pluriel : Les jeunes hérissons sont",null,"9ans","auto-questionnaire ecole","questionnaire enfant",null,null,null,null,null,"exercice de conjugaison"]
[null,null,null,"Les hérissons entrent ","TRENT","A09X_TRENT",null,null,"donnée","dico",null,null,"Conjuguer un verbe à l'indicatif présent troisième personne du pluriel : Les hérissons entrent ",null,"9ans","auto-questionnaire ecole","questionnaire enfant",null,null,null,null,null,"exercice de conjugaison"]
[null,null,null,"Auparavant, ils","ILS","A09X_ILS",null,null,"donnée","dico",null,null,"Conjuguer un verbe à l'indicatif présent à la troisième personne du pluriel : Auparavant, ils",null,"9ans","auto-questionnaire ecole","questionnaire enfant",null,null,null,null,null,"exercice de conjugaison"]
[null,null,null,"Ils mangent comme quatre","GENT","A09X_GENT",null,null,"donnée","dico",null,null,"Conjuguer un verbe à l'indicatif présent à la troisième personne du pluriel : Ils mangent comme quatre",null,"9ans","auto-questionnaire ecole","questionnaire enfant",null,null,null,null,null,"exercice de conjugaison"]
[null,null,null,"Les jeunes","JEUNES","A09X_JEUNES",null,null,"donnée","dico",null,null,"Conjuguer un verbe à l'indicatif présent à la troisième personne du pluriel : Les jeunes",null,"9ans","auto-questionnaire ecole","questionnaire enfant",null,null,null,null,null,"exercice de conjugaison"]
[null,null,null,"Les jeunes hérissons","RISSONS","A09X_RISSONS",null,null,"donnée","dico",null,null,"Conjuguer un verbe à l'indicatif présent à la troisième personne du pluriel : Les jeunes hérissons",null,"9ans","auto-questionnaire ecole","questionnaire enfant",null,null,null,null,null,"exercice de conjugaison"]
[null,null,null,"Les jeunes hérissons sont","SONT","A09X_SONT",null,null,"donnée","dico",null,null,"Conjuguer un verbe à l'indicatif présent à la troisième personne du pluriel : Les jeunes hérissons sont",null,"9ans","auto-questionnaire ecole","questionnaire enfant",null,null,null,null,null,"exercice de conjugaison"]
[null,null,null,"Les champignons poussent sous les grands_1","LES_rc","A09X_LES_rc",null,null,"donnée","dico",null,"E9A_EC_FORMAT4F","Ecrire une phrase : Les champignons poussent sous les grands_1",null,"9ans","auto-questionnaire ecole","questionnaire enfant",null,null,null,null,null,"exercice de dictée"]
[null,null,null,"Les champignons poussent sous les grands_2","GNONS_rc","A09X_GNONS_rc",null,null,"donnée","dico",null,"E9A_EC_FORMAT4F","Ecrire une phrase : Les champignons poussent sous les grands_2",null,"9ans","auto-questionnaire ecole","questionnaire enfant",null,null,null,null,null,"exercice de dictée"]
[null,null,null,"Les champignons poussent sous les grands_3","ENT_rc","A09X_ENT_rc",null,null,"donnée","dico",null,"E9A_EC_FORMAT4F","Ecrire une phrase : Les champignons poussent sous les grands_3",null,"9ans","auto-questionnaire ecole","questionnaire enfant",null,null,null,null,null,"exercice de dictée"]
[null,null,null,"Les champignons poussent sous les grands_4","POUSSE_rc","A09X_POUSSE_rc",null,null,"donnée","dico",null,"E9A_EC_FORMAT4F","Ecrire une phrase : Les champignons poussent sous les grands_4",null,"9ans","auto-questionnaire ecole","questionnaire enfant",null,null,null,null,null,"exercice de dictée"]
[null,null,null,"Les champignons poussent sous les grands_5","SOUS_rc","A09X_SOUS_rc",null,null,"donnée","dico",null,"E9A_EC_FORMAT4F","Ecrire une phrase : Les champignons poussent sous les grands_5",null,"9ans","auto-questionnaire ecole","questionnaire enfant",null,null,null,null,null,"exercice de dictée"]
[null,null,null,"Les champignons poussent sous les grands_6","GRANDS_rc","A09X_GRANDS_rc",null,null,"donnée","dico",null,"E9A_EC_FORMAT4F","Ecrire une phrase : Les champignons poussent sous les grands_6",null,"9ans","auto-questionnaire ecole","questionnaire enfant",null,null,null,null,null,"exercice de dictée"]
[null,null,null,"Les champignons poussent sous les grands_7","GRAND_rc","A09X_GRAND_rc",null,null,"donnée","dico",null,"E9A_EC_FORMAT4F","Ecrire une phrase : Les champignons poussent sous les grands_7",null,"9ans","auto-questionnaire ecole","questionnaire enfant",null,null,null,null,null,"exercice de dictée"]
[null,null,null,"Les champignons poussent sous les grands_8","ARBRE_rc","A09X_ARBRE_rc",null,null,"donnée","dico",null,"E9A_EC_FORMAT4F","Ecrire une phrase : Les champignons poussent sous les grands_8",null,"9ans","auto-questionnaire ecole","questionnaire enfant",null,null,null,null,null,"exercice de dictée"]
[null,null,null,"Les champignons poussent sous les grands_1","LES","A09X_LES",null,null,"donnée","dico",null,null,"Ecrire une phrase : Les champignons poussent sous les grands_1",null,"9ans","auto-questionnaire ecole","questionnaire enfant",null,null,null,null,null,"exercice de dictée"]
[null,null,null,"Les champignons poussent sous les grands_2","GNONS","A09X_GNONS",null,null,"donnée","dico",null,null,"Ecrire une phrase : Les champignons poussent sous les grands_2",null,"9ans","auto-questionnaire ecole","questionnaire enfant",null,null,null,null,null,"exercice de dictée"]
[null,null,null,"Les champignons poussent sous les grands_3","ENT","A09X_ENT",null,null,"donnée","dico",null,null,"Ecrire une phrase : Les champignons poussent sous les grands_3",null,"9ans","auto-questionnaire ecole","questionnaire enfant",null,null,null,null,null,"exercice de dictée"]
[null,null,null,"Les champignons poussent sous les grands_4","POUSSE","A09X_POUSSE",null,null,"donnée","dico",null,null,"Ecrire une phrase : Les champignons poussent sous les grands_4",null,"9ans","auto-questionnaire ecole","questionnaire enfant",null,null,null,null,null,"exercice de dictée"]
[null,null,null,"Les champignons poussent sous les grands_5","SOUS","A09X_SOUS",null,null,"donnée","dico",null,null,"Ecrire une phrase : Les champignons poussent sous les grands_5",null,"9ans","auto-questionnaire ecole","questionnaire enfant",null,null,null,null,null,"exercice de dictée"]
[null,null,null,"Les champignons poussent sous les grands_6","GRANDS","A09X_GRANDS",null,null,"donnée","dico",null,null,"Ecrire une phrase : Les champignons poussent sous les grands_6",null,"9ans","auto-questionnaire ecole","questionnaire enfant",null,null,null,null,null,"exercice de dictée"]
[null,null,null,"Les champignons poussent sous les grands_7","GRAND","A09X_GRAND",null,null,"donnée","dico",null,null,"Ecrire une phrase : Les champignons poussent sous les grands_7",null,"9ans","auto-questionnaire ecole","questionnaire enfant",null,null,null,null,null,"exercice de dictée"]
[null,null,null,"Les champignons poussent sous les grands_8","ARBRE","A09X_ARBRE",null,null,"donnée","dico",null,null,"Ecrire une phrase : Les champignons poussent sous les grands_8",null,"9ans","auto-questionnaire ecole","questionnaire enfant",null,null,null,null,null,"exercice de dictée"]
[null,null,null,"Mois de réalisation des  exercices","REAL09_11_rc","A09X_REAL09_11_rc",null,null,"donnée","dico",null,null,"Exercice réalisé en septembre",null,"9ans","auto-questionnaire ecole","questionnaire enfant"]
[null,null,null,"Exercice réalisé en octobre","REAL09","A09X_REAL09",null,null,"donnée","dico",null,"E9A_EC_FORMAT18S","Exercice réalisé en septembre",null,"9ans","auto-questionnaire ecole","questionnaire enfant"]
[null,null,null,"Exercice réalisé en novembre","REAL10","A09X_REAL10",null,null,"donnée","dico",null,"E9A_EC_FORMAT18S","Exercice réalisé en octobre",null,"9ans","auto-questionnaire ecole","questionnaire enfant"]
[null,null,null,"Exercice réalisé en décembre","REAL11","A09X_REAL11",null,null,"donnée","dico",null,"E9A_EC_FORMAT18S","Exercice réalisé en novembre",null,"9ans","auto-questionnaire ecole","questionnaire enfant",null,null,null,null,null,null,null,0]
[null,null,null,"QUESTIONNAIRE ENSEIGNANT",null,null,null,null,null,null,null,null,null,null,null,null,null,null,null,null,null,null,null,null,1]
[null,null,null,"A quel niveau est scolarisé l'enfant Elfe/Epipage ?","SCOL","A09X_SCOL",null,null,"donnée","dico",null,"E9A_EC_FORMAT14S","A quel niveau est scolarisé l’enfant Elfe/Epipage ?",null,"9ans","auto-questionnaire ecole","questionnaire enseignant","","","","","","questionnaire enseignant",""]
[null,null,null,"A quel niveau est scolarisé l'enfant Elfe/Epipage ? préciser","SCOLP","A09X_SCOLP",null,null,"non-disponible","text20",null,"","A quel niveau est scolarisé l'enfant Elfe/Epipage ? préciser",null,"9ans","auto-questionnaire ecole","questionnaire enseignant","","","","","","questionnaire enseignant",""]
[null,null,null,"Selon votre expérience professionnelle, comment évaluez-vous les compétences de l’enfant par rapport aux enfants de son âge (et pas seulement les enfants de votre classe ou de l’école)","FRANCAIS","A09X_FRANCAIS",null,null,"donnée","dico",null,"E9A_EC_FORMAT15S","Selon votre expérience professionnelle, comment évaluez-vous les compétences de l’enfant par rapport aux enfants de son âge (et pas seulement les enfants de votre classe ou de l’école)",null,"9ans","auto-questionnaire ecole","questionnaire enseignant","","","","","","questionnaire enseignant",""]
[null,null,null,"Selon votre expérience professionnelle, comment évaluez-vous les compétences de l’enfant par rapport aux enfants de son âge (et pas seulement les enfants de votre classe ou de l’école)","MATHEMATIQUES","A09X_MATHEMATIQUES",null,null,"donnée","dico",null,"E9A_EC_FORMAT15S","Selon votre expérience professionnelle, comment évaluez-vous les compétences de l’enfant par rapport aux enfants de son âge (et pas seulement les enfants de votre classe ou de l’école)",null,"9ans","auto-questionnaire ecole","questionnaire enseignant","","","","","","questionnaire enseignant",""]
[null,null,null,"Selon votre expérience professionnelle, comment évaluez-vous les compétences de l’enfant par rapport aux enfants de son âge (et pas seulement les enfants de votre classe ou de l’école)","ACTIPHYS","A09X_ACTIPHYS",null,null,"donnée","dico",null,"E9A_EC_FORMAT15S","Selon votre expérience professionnelle, comment évaluez-vous les compétences de l’enfant par rapport aux enfants de son âge (et pas seulement les enfants de votre classe ou de l’école)",null,"9ans","auto-questionnaire ecole","questionnaire enseignant","","","","","","questionnaire enseignant",""]
[null,null,null,"Selon votre expérience professionnelle, comment évaluez-vous les compétences de l’enfant par rapport aux enfants de son âge (et pas seulement les enfants de votre classe ou de l’école)","LANGVIV","A09X_LANGVIV",null,null,"donnée","dico",null,"E9A_EC_FORMAT15S","Selon votre expérience professionnelle, comment évaluez-vous les compétences de l’enfant par rapport aux enfants de son âge (et pas seulement les enfants de votre classe ou de l’école)",null,"9ans","auto-questionnaire ecole","questionnaire enseignant","","","","","","questionnaire enseignant",""]
[null,null,null,"Selon votre expérience professionnelle, comment évaluez-vous les compétences de l’enfant par rapport aux enfants de son âge (et pas seulement les enfants de votre classe ou de l’école)","ACTIARTIS","A09X_ACTIARTIS",null,null,"donnée","dico",null,"E9A_EC_FORMAT15S","Selon votre expérience professionnelle, comment évaluez-vous les compétences de l’enfant par rapport aux enfants de son âge (et pas seulement les enfants de votre classe ou de l’école)",null,"9ans","auto-questionnaire ecole","questionnaire enseignant","","","","","","questionnaire enseignant",""]
[null,null,null,"Selon votre expérience professionnelle, comment évaluez-vous les compétences de l’enfant par rapport aux enfants de son âge (et pas seulement les enfants de votre classe ou de l’école)","QUESTMONDE","A09X_QUESTMONDE",null,null,"donnée","dico",null,"E9A_EC_FORMAT15S","Selon votre expérience professionnelle, comment évaluez-vous les compétences de l’enfant par rapport aux enfants de son âge (et pas seulement les enfants de votre classe ou de l’école)",null,"9ans","auto-questionnaire ecole","questionnaire enseignant","","","","","","questionnaire enseignant",""]
[null,null,null,"Selon votre expérience professionnelle, comment évaluez-vous les compétences de l’enfant par rapport aux enfants de son âge (et pas seulement les enfants de votre classe ou de l’école)","MORALCIVIC","A09X_MORALCIVIC",null,null,"donnée","dico",null,"E9A_EC_FORMAT15S","Selon votre expérience professionnelle, comment évaluez-vous les compétences de l’enfant par rapport aux enfants de son âge (et pas seulement les enfants de votre classe ou de l’école)",null,"9ans","auto-questionnaire ecole","questionnaire enseignant","","","","","","questionnaire enseignant",""]
[null,null,null,"En vous basant sur les six derniers mois et pour chacun des items ci-dessous, indiquer s’il s’applique au comportement de l’enfant","ATTENTA","A09X_ATTENTA",null,null,"donnée","dico",null,"E9A_EC_FORMAT16S","SDQ : En vous basant sur les six derniers mois et pour chacun des items ci-dessous, indiquer s’il s’applique au comportement de l’enfant",null,"9ans","auto-questionnaire ecole","questionnaire enseignant","",null,"","","","questionnaire enseignant",""]
[null,null,null,"En vous basant sur les six derniers mois et pour chacun des items ci-dessous, indiquer s’il s’applique au comportement de l’enfant","AGITE","A09X_AGITE",null,null,"donnée","dico",null,"E9A_EC_FORMAT16S","SDQ : En vous basant sur les six derniers mois et pour chacun des items ci-dessous, indiquer s’il s’applique au comportement de l’enfant",null,"9ans","auto-questionnaire ecole","questionnaire enseignant","",null,"","","","questionnaire enseignant",""]
[null,null,null,"En vous basant sur les six derniers mois et pour chacun des items ci-dessous, indiquer s’il s’applique au comportement de l’enfant","PARTAG","A09X_PARTAG",null,null,"donnée","dico",null,"E9A_EC_FORMAT16S","SDQ : En vous basant sur les six derniers mois et pour chacun des items ci-dessous, indiquer s’il s’applique au comportement de l’enfant",null,"9ans","auto-questionnaire ecole","questionnaire enseignant","",null,"","","","questionnaire enseignant",""]
[null,null,null,"En vous basant sur les six derniers mois et pour chacun des items ci-dessous, indiquer s’il s’applique au comportement de l’enfant","COLERE","A09X_COLERE",null,null,"donnée","dico",null,"E9A_EC_FORMAT16S","SDQ : En vous basant sur les six derniers mois et pour chacun des items ci-dessous, indiquer s’il s’applique au comportement de l’enfant",null,"9ans","auto-questionnaire ecole","questionnaire enseignant",null,null,null,null,null,"questionnaire enseignant"]
[null,null,null,"En vous basant sur les six derniers mois et pour chacun des items ci-dessous, indiquer s’il s’applique au comportement de l’enfant","OBEIS","A09X_OBEIS",null,null,"donnée","dico",null,"E9A_EC_FORMAT16S","SDQ : En vous basant sur les six derniers mois et pour chacun des items ci-dessous, indiquer s’il s’applique au comportement de l’enfant",null,"9ans","auto-questionnaire ecole","questionnaire enseignant","",null,"","","","questionnaire enseignant",""]
[null,null,null,"En vous basant sur les six derniers mois et pour chacun des items ci-dessous, indiquer s’il s’applique au comportement de l’enfant","PITIE","A09X_PITIE",null,null,"donnée","dico",null,"E9A_EC_FORMAT16S","SDQ : En vous basant sur les six derniers mois et pour chacun des items ci-dessous, indiquer s’il s’applique au comportement de l’enfant",null,"9ans","auto-questionnaire ecole","questionnaire enseignant",null,null,null,null,null,"questionnaire enseignant"]
[null,null,null,"En vous basant sur les six derniers mois et pour chacun des items ci-dessous, indiquer s’il s’applique au comportement de l’enfant","NTIENTP","A09X_NTIENTP",null,null,"donnée","dico",null,"E9A_EC_FORMAT16S","SDQ : En vous basant sur les six derniers mois et pour chacun des items ci-dessous, indiquer s’il s’applique au comportement de l’enfant",null,"9ans","auto-questionnaire ecole","questionnaire enseignant","",null,"","","","questionnaire enseignant",""]
[null,null,null,"En vous basant sur les six derniers mois et pour chacun des items ci-dessous, indiquer s’il s’applique au comportement de l’enfant","BAGAR","A09X_BAGAR",null,null,"donnée","dico",null,"E9A_EC_FORMAT16S","SDQ : En vous basant sur les six derniers mois et pour chacun des items ci-dessous, indiquer s’il s’applique au comportement de l’enfant",null,"9ans","auto-questionnaire ecole","questionnaire enseignant",null,null,null,null,null,"questionnaire enseignant"]
[null,null,null,"En vous basant sur les six derniers mois et pour chacun des items ci-dessous, indiquer s’il s’applique au comportement de l’enfant","DISTRA","A09X_DISTRA",null,null,"donnée","dico",null,"E9A_EC_FORMAT16S","SDQ : En vous basant sur les six derniers mois et pour chacun des items ci-dessous, indiquer s’il s’applique au comportement de l’enfant",null,"9ans","auto-questionnaire ecole","questionnaire enseignant","",null,"","","","questionnaire enseignant",""]
[null,null,null,"En vous basant sur les six derniers mois et pour chacun des items ci-dessous, indiquer s’il s’applique au comportement de l’enfant","GENTIL","A09X_GENTIL",null,null,"donnée","dico",null,"E9A_EC_FORMAT16S","SDQ : En vous basant sur les six derniers mois et pour chacun des items ci-dessous, indiquer s’il s’applique au comportement de l’enfant",null,"9ans","auto-questionnaire ecole","questionnaire enseignant","",null,"","","","questionnaire enseignant",""]
[null,null,null,"En vous basant sur les six derniers mois et pour chacun des items ci-dessous, indiquer s’il s’applique au comportement de l’enfant","MENT","A09X_MENT",null,null,"donnée","dico",null,"E9A_EC_FORMAT16S","SDQ : En vous basant sur les six derniers mois et pour chacun des items ci-dessous, indiquer s’il s’applique au comportement de l’enfant",null,"9ans","auto-questionnaire ecole","questionnaire enseignant",null,null,null,null,null,"questionnaire enseignant"]
[null,null,null,"En vous basant sur les six derniers mois et pour chacun des items ci-dessous, indiquer s’il s’applique au comportement de l’enfant","AIDE","A09X_AIDE",null,null,"donnée","dico",null,"E9A_EC_FORMAT16S","SDQ : En vous basant sur les six derniers mois et pour chacun des items ci-dessous, indiquer s’il s’applique au comportement de l’enfant",null,"9ans","auto-questionnaire ecole","questionnaire enseignant","",null,"","","","questionnaire enseignant",""]
[null,null,null,"En vous basant sur les six derniers mois et pour chacun des items ci-dessous, indiquer s’il s’applique au comportement de l’enfant","REFLECHI","A09X_REFLECHI",null,null,"donnée","dico",null,"E9A_EC_FORMAT16S","SDQ : En vous basant sur les six derniers mois et pour chacun des items ci-dessous, indiquer s’il s’applique au comportement de l’enfant",null,"9ans","auto-questionnaire ecole","questionnaire enseignant","","","","","","questionnaire enseignant",""]
[null,null,null,"En vous basant sur les six derniers mois et pour chacun des items ci-dessous, indiquer s’il s’applique au comportement de l’enfant","ACCAPA","A09X_ACCAPA",null,null,"donnée","dico",null,"E9A_EC_FORMAT16S","SDQ : En vous basant sur les six derniers mois et pour chacun des items ci-dessous, indiquer s’il s’applique au comportement de l’enfant",null,"9ans","auto-questionnaire ecole","questionnaire enseignant",null,null,null,null,null,"questionnaire enseignant"]
[null,null,null,"En vous basant sur les six derniers mois et pour chacun des items ci-dessous, indiquer s’il s’applique au comportement de l’enfant","ATTENTI","A09X_ATTENTI",null,null,"donnée","dico",null,"E9A_EC_FORMAT16S","SDQ : En vous basant sur les six derniers mois et pour chacun des items ci-dessous, indiquer s’il s’applique au comportement de l’enfant",null,"9ans","auto-questionnaire ecole","questionnaire enseignant","","","","","","questionnaire enseignant",""]
[null,null,null,"Un ou plusieurs troubles concernent-ils cet enfant ? difficultés d'apprentissage","TROUBLE1","A09X_TROUBLE1",null,null,"donnée","dico",null,"E9A_EC_FORMAT18S","Un ou plusieurs troubles concernent-ils cet enfant ? difficultés d’apprentissage",null,"9ans","auto-questionnaire ecole","questionnaire enseignant","","","","","","questionnaire enseignant",""]
[null,null,null,"Un ou plusieurs troubles concernent-ils cet enfant ? difficultés de la mémorisation","TROUBLE2","A09X_TROUBLE2",null,null,"donnée","dico",null,"E9A_EC_FORMAT18S","Un ou plusieurs troubles concernent-ils cet enfant ? difficultés de la mémorisation",null,"9ans","auto-questionnaire ecole","questionnaire enseignant","","","","","","questionnaire enseignant",""]
[null,null,null,"Un ou plusieurs troubles concernent-ils cet enfant ? troubles du langage et de la parole","TROUBLE3","A09X_TROUBLE3",null,null,"donnée","dico",null,"E9A_EC_FORMAT18S","Un ou plusieurs troubles concernent-ils cet enfant ? troubles du langage et de la parole",null,"9ans","auto-questionnaire ecole","questionnaire enseignant","","","","","","questionnaire enseignant",""]
[null,null,null,"Un ou plusieurs troubles concernent-ils cet enfant ? problème ou déficit auditif","TROUBLE4","A09X_TROUBLE4",null,null,"donnée","dico",null,"E9A_EC_FORMAT18S","Un ou plusieurs troubles concernent-ils cet enfant ? problème ou déficit auditif",null,"9ans","auto-questionnaire ecole","questionnaire enseignant","","","","","","questionnaire enseignant",""]
[null,null,null,"Un ou plusieurs troubles concernent-ils cet enfant ? problème ou déficit visuel","TROUBLE5","A09X_TROUBLE5",null,null,"donnée","dico",null,"E9A_EC_FORMAT18S","Un ou plusieurs troubles concernent-ils cet enfant ? problème ou déficit visuel",null,"9ans","auto-questionnaire ecole","questionnaire enseignant","","","","","","questionnaire enseignant",""]
[null,null,null,"Un ou plusieurs troubles concernent-ils cet enfant ? autre handicap physique ou moteur","TROUBLE6","A09X_TROUBLE6",null,null,"donnée","dico",null,"E9A_EC_FORMAT18S","Un ou plusieurs troubles concernent-ils cet enfant ? autre handicap physique ou moteur",null,"9ans","auto-questionnaire ecole","questionnaire enseignant","","","","","","questionnaire enseignant",""]
[null,null,null,"Un ou plusieurs troubles concernent-ils cet enfant ? troubles importants de la fonction cognitive ou retard mental ou déficience intellectuelle","TROUBLE7","A09X_TROUBLE7",null,null,"donnée","dico",null,"E9A_EC_FORMAT18S","Un ou plusieurs troubles concernent-ils cet enfant ? troubles importants de la fonction cognitive ou retard mental ou déficience intellectuelle",null,"9ans","auto-questionnaire ecole","questionnaire enseignant","","","","","","questionnaire enseignant",""]
[null,null,null,"Un ou plusieurs troubles concernent-ils cet enfant ? troubles de type autistique","TROUBLE8","A09X_TROUBLE8",null,null,"donnée","dico",null,"E9A_EC_FORMAT18S","Un ou plusieurs troubles concernent-ils cet enfant ? troubles de type autistique",null,"9ans","auto-questionnaire ecole","questionnaire enseignant","","","","","","questionnaire enseignant",""]
[null,null,null,"Un ou plusieurs troubles concernent-ils cet enfant ? troubles du psychisme (anxiété, dépression, inhibition…)","TROUBLE9","A09X_TROUBLE9",null,null,"donnée","dico",null,"E9A_EC_FORMAT18S","Un ou plusieurs troubles concernent-ils cet enfant ? troubles du psychisme (anxiété, dépression, inhibition…)",null,"9ans","auto-questionnaire ecole","questionnaire enseignant","","","","","","questionnaire enseignant",""]
[null,null,null,"Un ou plusieurs troubles concernent-ils cet enfant ? haut potentiel ou enfant précoce","TROUBLE10","A09X_TROUBLE10",null,null,"donnée","dico",null,"E9A_EC_FORMAT18S","Un ou plusieurs troubles concernent-ils cet enfant ? haut potentiel ou enfant précoce",null,"9ans","auto-questionnaire ecole","questionnaire enseignant","","","","","","questionnaire enseignant",""]
[null,null,null,"Un ou plusieurs troubles concernent-ils cet enfant ? Autre","TROUBLE11","A09X_TROUBLE11",null,null,"donnée","dico",null,"E9A_EC_FORMAT18S","Un ou plusieurs troubles concernent-ils cet enfant ? Autre",null,"9ans","auto-questionnaire ecole","questionnaire enseignant","","","","","","questionnaire enseignant",""]
[null,null,null,"Un ou plusieurs troubles concernent-ils cet enfant ? autre. préciser","TROUBLEP","A09X_TROUBLEP",null,null,"non-disponible","text40",null,null,"Un ou plusieurs troubles concernent-ils cet enfant ? autre. préciser",null,"9ans","auto-questionnaire ecole","questionnaire enseignant","","","","","","questionnaire enseignant",""]
[null,null,null,"Un ou plusieurs troubles concernent-ils cet enfant ? aucun trouble détecté","TROUBLE12","A09X_TROUBLE12",null,null,"donnée","dico",null,"E9A_EC_FORMAT18S","Un ou plusieurs troubles concernent-ils cet enfant ? aucun des troubles précédents",null,"9ans","auto-questionnaire ecole","questionnaire enseignant","","","","","","questionnaire enseignant",""]
[null,null,null,"Selon vous, l'une des difficultés rencontrées par l'enfant nécessite-t-il une prise en charge particulière ?","BESOIN","A09X_BESOIN",null,null,"donnée","dico",null,"E9A_EC_YORN","Selon vous, l’une des difficultés rencontrées par l’enfant nécessite-t-il une prise en charge particulière ?",null,"9ans","auto-questionnaire ecole","questionnaire enseignant","","","","","","questionnaire enseignant",""]
[null,null,null,"De quel type de prise en charge l'enfant bénéficie-t-il ? programme personnalisé de réussite éducative (ppre)","DISPOSITIF1","A09X_DISPOSITIF1",null,null,"donnée","dico",null,"E9A_EC_FORMAT18S","De quel type de prise en charge l’enfant bénéficie-t-il ? programme personnalisé de réussite éducative (ppre)",null,"9ans","auto-questionnaire ecole","questionnaire enseignant","","","","","","questionnaire enseignant",""]
[null,null,null,"De quel type de prise en charge l'enfant bénéficie-t-il ? soutien d'un membre du rased","DISPOSITIF2","A09X_DISPOSITIF2",null,null,"donnée","dico",null,"E9A_EC_FORMAT18S","De quel type de prise en charge l’enfant bénéficie-t-il ? soutien d’un membre du rased",null,"9ans","auto-questionnaire ecole","questionnaire enseignant","","","","","","questionnaire enseignant",""]
[null,null,null,"De quel type de prise en charge l'enfant bénéficie-t-il ? prise en charge spécifique dans le cadre scolaire","DISPOSITIF3","A09X_DISPOSITIF3",null,null,"donnée","dico",null,"E9A_EC_FORMAT18S","De quel type de prise en charge l’enfant bénéficie-t-il ? prise en charge spécifique dans le cadre scolaire",null,"9ans","auto-questionnaire ecole","questionnaire enseignant","","","","","","questionnaire enseignant",""]
[null,null,null,"De quel type de prise en charge l'enfant bénéficie-t-il ? aide humaine ou avs","DISPOSITIF4","A09X_DISPOSITIF4",null,null,"donnée","dico",null,"E9A_EC_FORMAT18S","De quel type de prise en charge l’enfant bénéficie-t-il ? aide humaine ou avs",null,"9ans","auto-questionnaire ecole","questionnaire enseignant","","","","","","questionnaire enseignant",""]
[null,null,null,"De quel type de prise en charge l'enfant bénéficie-t-il ? animateur, bénévole","DISPOSITIF5","A09X_DISPOSITIF5",null,null,"donnée","dico",null,"E9A_EC_FORMAT18S","De quel type de prise en charge l’enfant bénéficie-t-il ? animateur, bénévole",null,"9ans","auto-questionnaire ecole","questionnaire enseignant","","","","","","questionnaire enseignant",""]
[null,null,null,"De quel type de prise en charge l'enfant bénéficie-t-il ? enseignant","DISPOSITIF6","A09X_DISPOSITIF6",null,null,"donnée","dico",null,"E9A_EC_FORMAT18S","De quel type de prise en charge l’enfant bénéficie-t-il ? enseignant",null,"9ans","auto-questionnaire ecole","questionnaire enseignant","","","","","","questionnaire enseignant",""]
[null,null,null,"De quel type de prise en charge l'enfant bénéficie-t-il ? Autre.","DISPOSITIF7","A09X_DISPOSITIF7",null,null,"donnée","dico",null,"E9A_EC_FORMAT18S","De quel type de prise en charge l’enfant bénéficie-t-il ? autre. préciser",null,"9ans","auto-questionnaire ecole","questionnaire enseignant","","","","","","questionnaire enseignant",""]
[null,null,null,"De quel type de prise en charge l'enfant bénéficie-t-il ? Autre. préciser","DISPOSITIF7P","A09X_DISPOSITIF7P",null,null,"non-disponible","text40",null,null,"De quel type de prise en charge l'enfant bénéficie-t-il ? Autre",null,"9ans","auto-questionnaire ecole","questionnaire enseignant",null,null,null,null,null,"questionnaire enseignant"]
[null,null,null,"De quel type de prise en charge l'enfant bénéficie-t-il ? projet d'accueil individualisé (pai)","DISPOSITIF8","A09X_DISPOSITIF8",null,null,"donnée","dico",null,"E9A_EC_FORMAT18S","De quel type de prise en charge l'enfant bénéficie-t-il ? autre dispositif impliquant des personnels extérieurs. préciser",null,"9ans","auto-questionnaire ecole","questionnaire enseignant","","","","","","questionnaire enseignant",""]
[null,null,null,"De quel type de prise en charge l'enfant bénéficie-t-il ? projet personnalisé de scolarisation (pps) ","DISPOSITIF9","A09X_DISPOSITIF9",null,null,"donnée","dico",null,"E9A_EC_FORMAT18S","De quel type de prise en charge l’enfant bénéficie-t-il ? projet personnalisé de scolarisation (pps)",null,"9ans","auto-questionnaire ecole","questionnaire enseignant","","","","","","questionnaire enseignant",""]
[null,null,null,"De quel type de prise en charge l'enfant bénéficie-t-il ? autre dispositif impliquant des personnels extérieurs","DISPOSITIF10","A09X_DISPOSITIF10",null,null,"donnée","dico",null,"E9A_EC_FORMAT18S","De quel type de prise en charge l’enfant bénéficie-t-il ? autre dispositif impliquant des personnels extérieurs. préciser",null,"9ans","auto-questionnaire ecole","questionnaire enseignant","","","","","","questionnaire enseignant",""]
[null,null,null,"De quel type de prise en charge l'enfant bénéficie-t-il ? autre dispositif impliquant des personnels extérieurs. préciser","DISPOSITIF10P","A09X_DISPOSITIF10P",null,null,"non-disponible","text40",null,null,"S ’agit-il d’une classe simple ou à plusieurs niveaux ? préciser",null,"9ans","auto-questionnaire ecole","questionnaire enseignant",null,null,null,null,null,"questionnaire enseignant"]
[null,null,null,"De quel type de prise en charge l'enfant bénéficie-t-il ? aucun des dispositifs précédents","DISPOSITIF11","A09X_DISPOSITIF11",null,null,"donnée","dico",null,"E9A_EC_FORMAT18S","De quel type de prise en charge l’enfant bénéficie-t-il ? aucun des dispositifs précédents",null,"9ans","auto-questionnaire ecole","questionnaire enseignant","","","","","","questionnaire enseignant",""]
[null,null,null,"Quel est l’effectif de votre classe ?","NBELEVES","A09X_NBELEVES",null,null,"donnée","float",null,"","Quel est l’effectif de votre classe ?",null,"9ans","auto-questionnaire ecole","questionnaire enseignant","","","","","","questionnaire enseignant",""]
[null,null,null,"S ’agit-il d’une classe simple ou à plusieurs niveaux ? (CE2)","NIVECLASS1","A09X_NIVECLASS1",null,null,"donnée","dico",null,"E9A_EC_FORMAT18S","S ’agit-il d’une classe simple ou à plusieurs niveaux ? (CE2)",null,"9ans","auto-questionnaire ecole","questionnaire enseignant","","","","","","questionnaire enseignant",""]
[null,null,null,"S ’agit-il d’une classe simple ou à plusieurs niveaux ? (CM1)","NIVECLASS2","A09X_NIVECLASS2",null,null,"donnée","dico",null,"E9A_EC_FORMAT18S","S ’agit-il d’une classe simple ou à plusieurs niveaux ? (CM1)",null,"9ans","auto-questionnaire ecole","questionnaire enseignant","","","","","","questionnaire enseignant",""]
[null,null,null,"S ’agit-il d’une classe simple ou à plusieurs niveaux ? (CM2)","NIVECLASS3","A09X_NIVECLASS3",null,null,"donnée","dico",null,"E9A_EC_FORMAT18S","S ’agit-il d’une classe simple ou à plusieurs niveaux ? (CM2)",null,"9ans","auto-questionnaire ecole","questionnaire enseignant","","","","","","questionnaire enseignant",""]
[null,null,null,"S ’agit-il d’une classe simple ou à plusieurs niveaux ? (CE2-CM1)","NIVECLASS4","A09X_NIVECLASS4",null,null,"donnée","dico",null,"E9A_EC_FORMAT18S","S ’agit-il d’une classe simple ou à plusieurs niveaux ? (CE2-CM1)",null,"9ans","auto-questionnaire ecole","questionnaire enseignant","","","","","","questionnaire enseignant",""]
[null,null,null,"S ’agit-il d’une classe simple ou à plusieurs niveaux ? (CM1-CM2)","NIVECLASS5","A09X_NIVECLASS5",null,null,"donnée","dico",null,"E9A_EC_FORMAT18S","S ’agit-il d’une classe simple ou à plusieurs niveaux ? (CM1-CM2)",null,"9ans","auto-questionnaire ecole","questionnaire enseignant","","","","","","questionnaire enseignant",""]
[null,null,null,"S ’agit-il d’une classe simple ou à plusieurs niveaux ? Autre.","NIVECLASS6","A09X_NIVECLASS6",null,null,"donnée","dico",null,"E9A_EC_FORMAT18S","S ’agit-il d’une classe simple ou à plusieurs niveaux ? (autre)",null,"9ans","auto-questionnaire ecole","questionnaire enseignant","","","","","","questionnaire enseignant",""]
[null,null,null,"S ’agit-il d’une classe simple ou à plusieurs niveaux ? préciser","NIVECLASSP","A09X_NIVECLASSP",null,null,"non-disponible","text20",null,"","S ’agit-il d’une classe simple ou à  plusieurs niveaux ? préciser",null,"9ans","auto-questionnaire ecole","questionnaire enseignant","","","","","","questionnaire enseignant",""]
[null,null,null,"En classe ou à la maison, vos élèves utilisent-ils un manuel d'apprentissage à la lecture ?","LECTMANU","A09X_LECTMANU",null,null,"donnée","dico",null,"E9A_EC_YORN","En classe ou à  la maison, vos élèves utilisent-ils un manuel d’apprentissage à  la lecture ?",null,"9ans","auto-questionnaire ecole","questionnaire enseignant","","","","","","questionnaire enseignant",""]
[null,null,null,"Titre du principal manuel utilisé en lecture","LECTMANUP","A09X_LECTMANUP",null,null,"donnée","text60",null,"","Titre du principal manuel utilisé en lecture",null,"9ans","auto-questionnaire ecole","questionnaire enseignant","","","","","","questionnaire enseignant",""]
[null,null,null,"Editeur du principal manuel utilisé en lecture","LECTMANUPP","A09X_LECTMANUPP",null,null,"donnée","text60",null,"","Editeur du principal manuel utilisé en lecture",null,"9ans","auto-questionnaire ecole","questionnaire enseignant","","","","","","questionnaire enseignant",""]
[null,null,null,"En classe ou à la maison, vos élèves utilisent-ils un fichier d'activités ou d'exercices en lecture ?","LECTFICH","A09X_LECTFICH",null,null,"donnée","dico",null,"E9A_EC_YORN","En classe ou à  la maison, vos élèves utilisent-ils un fichier d’activités ou d’exercices en lecture ?",null,"9ans","auto-questionnaire ecole","questionnaire enseignant","","","","","","questionnaire enseignant",""]
[null,null,null,"Titre du principal fichier d'activités ou d'exercices utilisé en lecture","LECTFICHP","A09X_LECTFICHP",null,null,"donnée","text60",null,"","Titre du principal fichier d’activités ou d’exercices utilisé en lecture",null,"9ans","auto-questionnaire ecole","questionnaire enseignant","","","","","","questionnaire enseignant",""]
[null,null,null,"Editeur du principal fichier d'activités ou d'exercices utilisé en lecture","LECTFICHPP","A09X_LECTFICHPP",null,null,"donnée","text60",null,"","Editeur du principal fichier d’activités ou d’exercices utilisé en lecture",null,"9ans","auto-questionnaire ecole","questionnaire enseignant","","","","","","questionnaire enseignant",""]
[null,null,null,"En classe ou à la maison, vos élèves utilisent-ils un site internet d'apprentissage en lecture ?","LECTWEB","A09X_LECTWEB",null,null,"donnée","dico",null,"E9A_EC_YORN","En classe ou à  la maison, vos élèves utilisent-ils un site internet d’apprentissage en lecture ?",null,"9ans","auto-questionnaire ecole","questionnaire enseignant","","","","","","questionnaire enseignant",""]
[null,null,null,"Titre du principal site internet d'apprentissage utilisé en lecture","LECTWEBP","A09X_LECTWEBP",null,null,"donnée","text60",null,"","Titre du principal site internet d’apprentissage utilisé en lecture",null,"9ans","auto-questionnaire ecole","questionnaire enseignant","","","","","","questionnaire enseignant",""]
[null,null,null,"Editeur du principal site internet d'apprentissage utilisé en lecture","LECTWEBPP","A09X_LECTWEBPP",null,null,"donnée","text60",null,"","Editeur du principal site internet d’apprentissage utilisé en lecture",null,"9ans","auto-questionnaire ecole","questionnaire enseignant","","","","","","questionnaire enseignant",""]
[null,null,null,"En classe ou à la maison, vos élèves utilisent-ils un logiciel d'apprentissage en lecture ?","LECTLOGI","A09X_LECTLOGI",null,null,"donnée","dico",null,"E9A_EC_YORN","En classe ou à  la maison, vos élèves utilisent-ils un logiciel d’apprentissage en lecture ?",null,"9ans","auto-questionnaire ecole","questionnaire enseignant","","","","","","questionnaire enseignant",""]
[null,null,null,"Titre du principal logicel d'apprentissage utilisé en lecture","LECTLOGIP","A09X_LECTLOGIP",null,null,"donnée","text60",null,"","Titre du principal logicel d’apprentissage utilisé en lecture",null,"9ans","auto-questionnaire ecole","questionnaire enseignant","","","","","","questionnaire enseignant",""]
[null,null,null,"Editeur du principal logiciel d'apprentissage utilisé en lecture","LECTLOGIPP","A09X_LECTLOGIPP",null,null,"donnée","text60",null,"","Editeur du principal logiciel d’apprentissage utilisé en lecture",null,"9ans","auto-questionnaire ecole","questionnaire enseignant","","","","","","questionnaire enseignant",""]
[null,null,null,"En classe ou à la maison, vos élèves utilisent-ils un manuel d'apprentissage en mathématiques ?","MATHMANU","A09X_MATHMANU",null,null,"donnée","dico",null,"E9A_EC_YORN","En classe ou à  la maison, vos élèves utilisent-ils un manuel d’apprentissage en mathématiques ?",null,"9ans","auto-questionnaire ecole","questionnaire enseignant","","","","","","questionnaire enseignant",""]
[null,null,null,"Titre du principal manuel utilisé en mathématiques","MATHMANUP","A09X_MATHMANUP",null,null,"donnée","text60",null,"","Titre du principal manuel utilisé en mathématiques",null,"9ans","auto-questionnaire ecole","questionnaire enseignant","","","","","","questionnaire enseignant",""]
[null,null,null,"Editeur du principal manuel utilisé en mathématiques","MATHMANUPP","A09X_MATHMANUPP",null,null,"donnée","text60",null,"","Editeur du principal manuel utilisé en mathématiques",null,"9ans","auto-questionnaire ecole","questionnaire enseignant","","","","","","questionnaire enseignant",""]
[null,null,null,"En classe ou à la maison, vos élèves utilisent-ils un fichier d'activités ou d'exercices en mathématiques ?","MATHFICH","A09X_MATHFICH",null,null,"donnée","dico",null,"E9A_EC_YORN","En classe ou à  la maison, vos élèves utilisent-ils un fichier d’activités ou d’exercices en mathématiques ?",null,"9ans","auto-questionnaire ecole","questionnaire enseignant","","","","","","questionnaire enseignant",""]
[null,null,null,"Titre du principal fichier d'activités ou d'exercices utilisé en mathématiques","MATHFICHP","A09X_MATHFICHP",null,null,"donnée","text60",null,"","Titre du principal fichier d’activités ou d’exercices utilisé en mathématiques",null,"9ans","auto-questionnaire ecole","questionnaire enseignant","","","","","","questionnaire enseignant",""]
[null,null,null,"Editeur du principal fichier d'activités ou d'exercices utilisé en mathématiques","MATHFICHPP","A09X_MATHFICHPP",null,null,"donnée","text60",null,"","Editeur du principal fichier d’activités ou d’exercices utilisé en mathématiques",null,"9ans","auto-questionnaire ecole","questionnaire enseignant","","","","","","questionnaire enseignant",""]
[null,null,null,"En classe ou à la maison, vos élèves utilisent-ils un site internet d'apprentissage en mathématiques ?","MATHWEB","A09X_MATHWEB",null,null,"donnée","dico",null,"E9A_EC_YORN","En classe ou à  la maison, vos élèves utilisent-ils un site internet d’apprentissage en mathématiques ?",null,"9ans","auto-questionnaire ecole","questionnaire enseignant","","","","","","questionnaire enseignant",""]
[null,null,null,"Titre du principal site internet d'apprentissage utilisé en mathématiques","MATHWEBP","A09X_MATHWEBP",null,null,"donnée","text60",null,"","Titre du principal site internet d’apprentissage utilisé en mathématiques",null,"9ans","auto-questionnaire ecole","questionnaire enseignant","","","","","","questionnaire enseignant",""]
[null,null,null,"Editeur du principal site internet d'apprentissage utilisé en mathématiques","MATHWEBPP","A09X_MATHWEBPP",null,null,"donnée","text60",null,"","Editeur du principal site internet d’apprentissage utilisé en mathématiques",null,"9ans","auto-questionnaire ecole","questionnaire enseignant","","","","","","questionnaire enseignant",""]
[null,null,null,"En classe ou à la maison, vos élèves utilisent-ils un logiciel d'apprentissage en mathématiques ?","MATHLOGI","A09X_MATHLOGI",null,null,"donnée","dico",null,"E9A_EC_YORN","En classe ou à  la maison, vos élèves utilisent-ils un logiciel d’apprentissage en mathématiques ?",null,"9ans","auto-questionnaire ecole","questionnaire enseignant","","","","","","questionnaire enseignant",""]
[null,null,null,"Titre du principal logicel d'apprentissage utilisé en mathématiques","MATHLOGIP","A09X_MATHLOGIP",null,null,"donnée","text60",null,"","Titre du principal logicel d’apprentissage utilisé en mathématiques",null,"9ans","auto-questionnaire ecole","questionnaire enseignant","","","","","","questionnaire enseignant",""]
[null,null,null,"Editeur du principal logiciel d'apprentissage utilisé en mathématiques","MATHLOGIPP","A09X_MATHLOGIPP",null,null,"donnée","text60",null,"","Editeur du principal logiciel d’apprentissage utilisé en mathématiques",null,"9ans","auto-questionnaire ecole","questionnaire enseignant","","","","","","questionnaire enseignant",""]
[null,null,null,"Sexe de l'enseignant","ENSSEX","A09X_ENSSEX",null,null,"donnée","dico",null,"E9A_EC_ENSSEXE","Sexe de l’enseignant",null,"9ans","auto-questionnaire ecole","questionnaire enseignant","","","","","","questionnaire enseignant",""]
[null,null,null,"Age de l'enseignant","ENSAGE","A09X_ENSAGE",null,null,"donnée","float",null,"","Age de l’enseignant",null,"9ans","auto-questionnaire ecole","questionnaire enseignant","","","","","","questionnaire enseignant",""]
[null,null,null,"Etes-vous l'enseignant habituel de cette classe ? ","ENSHABIT","A09X_ENSHABIT",null,null,"donnée","dico",null,"E9A_EC_ENSHABIT","Etes-vous l’enseignant habituel de cette classe ?",null,"9ans","auto-questionnaire ecole","questionnaire enseignant","","","","","","questionnaire enseignant",""]
[null,null,null,"Depuis combien d’années enseignez-vous à ce niveau scolaire (y compris cette année) ?","ENSDUREE","A09X_ENSDUREE",null,null,"donnée","float",null,null,"Depuis combien d’années enseignez-vous à  ce niveau scolaire (y compris cette année) ?",null,"9ans","auto-questionnaire ecole","questionnaire enseignant","","","","","","questionnaire enseignant",""]
[null,null,null,"Selon votre expérience professionnelle, comment évaluez-vous le niveau de cette classe par rapport au niveau habituel des élèves, à ce moment de l’année scolaire ? ","CONFNIVCLAS","A09X_CONFNIVCLAS",null,null,"donnée","dico",null,"E9A_EC_CONFINIVCLAS","Selon votre expérience professionnelle, comment évaluez-vous le niveau de cette classe par rapport au niveau habituel des élèves, à ce moment de l’année scolaire ? ",null,"9ans","auto-questionnaire ecole","questionnaire enseignant",null,null,null,null,null,"questionnaire enseignant"]
[null,null,null,"Y a-t-il dans votre classe des enfants mis en difficulté ou dont la difficulté s’est accentuée du fait de la complexité de la continuité pédagogique pendant le confinement ?","CONFDIFFIC","A09X_CONFDIFFIC",null,null,"donnée","dico",null,"E9A_EC_YORN","Y a-t-il dans votre classe des enfants mis en difficulté ou dont la difficulté s’est accentuée du fait de la complexité de la continuité pédagogique pendant le confinement ?",null,"9ans","auto-questionnaire ecole","questionnaire enseignant",null,null,null,null,null,"questionnaire enseignant"]
[null,null,null,"Si oui combien d'élèves ?","CONFDIFFICP","A09X_CONFDIFFICP",null,null,"donnée","float",null,null,"Si oui combien d'élèves ?",null,"9ans","auto-questionnaire ecole","questionnaire enseignant",null,null,null,null,null,"questionnaire enseignant"]
[null,null,null,"Depuis la rentrée, avez-vous fait retravailler les enfants sur les programmes scolaires qui devaient être assurés au printemps dernier ?","CONFRETARD","A09X_CONFRETARD",null,null,"donnée","dico",null,"E9A_EC_YORN","Depuis la rentrée, avez-vous fait retravailler les enfants sur les programmes scolaires qui devaient être assurés au printemps dernier ?",null,"9ans","auto-questionnaire ecole","questionnaire enseignant",null,null,null,null,null,"questionnaire enseignant"]
[null,null,null,"Si oui, combien de semaines au total ont été ou seront consacrées à ce travail ?","CONFRETARDUR","A09X_CONFRETARDUR",null,null,"donnée","float",null,null,"Si oui, combien de semaines au total ont été ou seront consacrées à ce travail ?",null,"9ans","auto-questionnaire ecole","questionnaire enseignant",null,null,null,null,null,"questionnaire enseignant"]
[null,null,null,"Depuis la rentrée, avez-vous procédé à des ajustements pédagogiques liés au confinement ?","CONFPEDAGO","A09X_CONFPEDAGO",null,null,"donnée","dico",null,"E9A_EC_YORN","Depuis la rentrée, avez-vous procédé à des ajustements pédagogiques liés au confinement ?",null,"9ans","auto-questionnaire ecole","questionnaire enseignant",null,null,null,null,null,"questionnaire enseignant"]
[null,null,null,"Si oui, par une mise en place de groupes de niveau","CONFPEDAGOP1","A09X_CONFPEDAGOP1",null,null,"donnée","dico",null,"E9A_EC_YORN","Si oui, par une mise en place de groupes de niveau",null,"9ans","auto-questionnaire ecole","questionnaire enseignant",null,null,null,null,null,"questionnaire enseignant"]
[null,null,null,"Si oui, par une mise en place de groupes de besoins","CONFPEDAGOP2","A09X_CONFPEDAGOP2",null,null,"donnée","dico",null,"E9A_EC_YORN","Si oui, par une mise en place de groupes de besoins",null,"9ans","auto-questionnaire ecole","questionnaire enseignant",null,null,null,null,null,"questionnaire enseignant"]
[null,null,null,"Si oui, par un dispositif individualisé pour les élèves en difficulté","CONFPEDAGOP3","A09X_CONFPEDAGOP3",null,null,"donnée","dico",null,"E9A_EC_YORN","Si oui, par un dispositif individualisé pour les élèves en difficulté",null,"9ans","auto-questionnaire ecole","questionnaire enseignant",null,null,null,null,null,"questionnaire enseignant"]
[null,null,null,"Si oui par une autre manière d’enseigner à tous vos élèves","CONFPEDAGOP4","A09X_CONFPEDAGOP4",null,null,"donnée","dico",null,"E9A_EC_YORN","Si oui, par une mise en place de groupes de niveau",null,"9ans","auto-questionnaire ecole","questionnaire enseignant",null,null,null,null,null,"questionnaire enseignant",null,0]
[null,null,null,"SCORES",null,null,null,null,null,null,null,null,null,null,null,null,null,null,null,null,null,null,null,null,1]
[null,null,null,"J’apprends beaucoup de choses à l’école ","APPRENDS","A09X_APPRENDS",null,null,"donnée","float",null,null,"Echelle de satisfaction scolaire : J’apprends beaucoup de choses à l’école ",null,"9ans","auto-questionnaire ecole","questionnaire enfant","","","","","","mesure de l'estime de soi",""]
[null,null,null,"Je suis content.e d’aller à l’école","CONTENT","A09X_CONTENT",null,null,"donnée","float",null,null,"Echelle de satisfaction scolaire : Je suis content.e d’aller à l’école",null,"9ans","auto-questionnaire ecole","questionnaire enfant","","","","","","mesure de l'estime de soi",""]
[null,null,null,"Je me sens bien à l’école","SENSBIEN","A09X_SENSBIEN",null,null,"donnée","float",null,null,"Echelle de satisfaction scolaire : Je me sens bien à l’école",null,"9ans","auto-questionnaire ecole","questionnaire enfant","","","","","","mesure de l'estime de soi",""]
[null,null,null,"L’école est intéressante","INTERESS","A09X_INTERESS",null,null,"donnée","float",null,null,"Echelle de satisfaction scolaire : L’école est intéressante",null,"9ans","auto-questionnaire ecole","questionnaire enfant","","","","","","mesure de l'estime de soi",""]
[null,null,null,"J’aime les activités proposées à l’école","ACTIVITES","A09X_ACTIVITES",null,null,"donnée","float",null,null,"Echelle de satisfaction scolaire : J’aime les activités proposées à l’école",null,"9ans","auto-questionnaire ecole","questionnaire enfant","","","","","","mesure de l'estime de soi",""]
[null,null,null,"Score SDQ : échelle de troubles comportementaux","SCORE_SDQ_COMP_9ANS","A09X_SCORE_SDQ_COMP_9ANS",null,null,"donnée","num",null,null,"Score SDQ : échelle de troubles comportementaux"]
[null,null,null,"Score SDQ : échelle d'hyperactivité ","SCORE_SDQ_HYPER_9ANS","A09X_SCORE_SDQ_HYPER_9ANS",null,null,"donnée","num",null,null,"Score SDQ : échelle d'hyperactivité "]
[null,null,null,"Score SDQ : échelle prosocial","SCORE_SDQ_PRO_9ANS","A09X_SCORE_SDQ_PRO_9ANS",null,null,"donnée","num",null,null,"Score SDQ : échelle prosocial"]
[null,null,null,"Catégories score (normal, limite, anormal) : Troubles comportementaux","SCORE_CAT_SDQ_COMP_9ANS","A09X_SCORE_CAT_SDQ_COMP_9ANS",null,null,"donnée","num",null,"SDQ_ECOLE_COMPLET","Catégories score (normal, limite, anormal) : Troubles comportementaux"]
[null,null,null,"Catégories score (normal, limite, anormal) : Hyperactivité","SCORE_CAT_SDQ_HYPER_9ANS","A09X_SCORE_CAT_SDQ_HYPER_9ANS",null,null,"donnée","num",null,"SDQ_ECOLE_COMPLET","Catégories score (normal, limite, anormal) : Hyperactivité"]
[null,null,null,"Catégories score (normal, limite, anormal) : Comportement prosocial","SCORE_CAT_SDQ_PRO_9ANS","A09X_SCORE_CAT_SDQ_PRO_9ANS",null,null,"donnée","num",null,"SDQ_ECOLE_COMPLET","Catégories score (normal, limite, anormal) : Comportement prosocial"]
[null,null,null," Score aux items de compétence écouter","SCVISU ","A09X_SCVISU ",null,null,"donnée","num",null,null," Score aux items de compétence écouter"]
[null,null,null," Score aux items de compréhension écrite","SCCOMPE ","A09X_SCCOMPE ",null,null,"donnée","num",null,null," Score aux items de compréhension écrite"]
[null,null,null," Score aux items de compréhension orale","SCCOMPO ","A09X_SCCOMPO ",null,null,"donnée","num",null,null," Score aux items de compréhension orale"]
[null,null,null," Score aux items en compréhension d’une lecture","SCCOMPLECT ","A09X_SCCOMPLECT ",null,null,"donnée","num",null,null," Score aux items en compréhension d’une lecture"]
[null,null,null," Score synthétique du sous-domaine relatif à l’attention visuelle et à la compréhension orale et écrite (moyenne des quatre scores précédents)","FRAN1 ","A09X_FRAN1 ",null,null,"donnée","num",null,null," Score synthétique du sous-domaine relatif à l’attention visuelle et à la compréhension orale et écrite (moyenne des quatre scores précédents)"]
[null,null,null," Score aux items de la compétence conjugaison","SCCONJ ","A09X_SCCONJ ",null,null,"donnée","num",null,null," Score aux items de la compétence conjugaison"]
[null,null,null," Score aux items de grammaire et orthographe","SCGRAM ","A09X_SCGRAM ",null,null,"donnée","num",null,null," Score aux items de grammaire et orthographe"]
[null,null,null," Score aux items d’étude de la langue en contexte de dictée","SCDICTEE ","A09X_SCDICTEE ",null,null,"donnée","num",null,null," Score aux items d’étude de la langue en contexte de dictée"]
[null,null,null," Score synthétique du sous-domaine relatif à la grammaire et l’orthographe (moyenne des trois scores précédents)","FRAN2 ","A09X_FRAN2 ",null,null,"donnée","num",null,null," Score synthétique du sous-domaine relatif à la grammaire et l’orthographe (moyenne des trois scores précédents)"]
[null,null,null," Score moyen pour l’ensemble des compétences de lecture. Correspond à la moyenne des scores aux exercices. Il n’est calculé que si les enfants ont participé aux sept exercices.","SCMOYFR ","A09X_SCMOYFR ",null,null,"donnée","num",null,null," Score moyen pour l’ensemble des compétences de lecture. Correspond à la moyenne des scores aux exercices. Il n’est calculé que si les enfants ont participé aux sept exercices."]
[null,null,null," Score aux items de la compétence nombres et calculs","SCCALC ","A09X_SCCALC ",null,null,"donnée","num",null,null," Score aux items de la compétence nombres et calculs"]
[null,null,null," Score aux items de résolution de problèmes en utilisant des nombres entiers qu’il s’agisse de longueurs, de contenants ou de prix","SCPROBLEM ","A09X_SCPROBLEM ",null,null,"donnée","num",null,null," Score aux items de résolution de problèmes en utilisant des nombres entiers qu’il s’agisse de longueurs, de contenants ou de prix"]
[null,null,null," Score aux items de compréhension et de dénombrement des nombres entiers","SCSUITE ","A09X_SCSUITE ",null,null,"donnée","num",null,null," Score aux items de compréhension et de dénombrement des nombres entiers"]
[null,null,null,"Score aux items de compréhension des nombres","SCCOMPA ","A09X_SCCOMPA ",null,null,"donnée","num",null,null,"Score aux items de compréhension des nombres"]
[null,null,null,"Score moyen pour l’ensemble des compétences de mathématiques","SCMOYMATH ","A09X_SCMOYMATH ",null,null,"donnée","num",null,null,"Score moyen pour l’ensemble des compétences de mathématiques",null,null,null,null,null,null,null,null,null,null,null,0]

{"sheet":"E9A_COVID_T1","index":10,"n_rows":371,"n_cols":73,"rows_kept":371,"cut":false,"hidden":false,"merged":[]}
["SELECTION\n(par variable ou par section)","SELECTION\n(par thème 1)","SELECTION\n(par QUEST STANDARD)","LABEL","QUESTION QUESTIONNAIRE","QUESTION BASE","QUESTION BASE",null,"TYPE","FORMAT","CHAPEAU","DICO","DESCRIPTION","CONTRÔLE","THEME(01)","THEME(02)","THEME(03)","THEME1","THEME2","THEME3","THEME4","THEME5","THEME6","QUEST STANDARD","THEME_TITRE","","","","","","","","","","","","","","","","","","","","","","","","","","E9A_SAPRIS_T1","E9A_SAPRIS_T1","","","","","","","","","","","","","","","","","","","","",""]
[null,null,null,{"$f":"CONCATENATE(\"Sélection totale : \",COUNTIFS(A:A,\"X\",I:I,\"*\")+COUNTIFS(B:B,\"X\",I:I,\"*\")+COUNTIFS(C:C,\"X\",I:I,\"*\"),\" variable(s)\")","v":"Sélection totale : 0 variable(s)"},null,null,null,null,null,null,null,null,null,null,null,null,null,null,null,null,null,null,null,null,null,null,{"$f":"COUNTIFS(A:A,\"X\",I:I,\"non-disponible\")+COUNTIFS(B:B,\"X\",I:I,\"non-disponible\")+COUNTIFS(C:C,\"X\",I:I,\"non-disponible\")","v":0},{"$f":"SUM(COUNTIFS($A:$A,\"X\",$E:$E,{\"ACRELI\";\"ACCHRET\";\"ACMUSUL\";\"LRELI\";\"QLCHRET\";\"QLMUSUL\";\"POLIT\"})+COUNTIFS($B:$B,\"X\",$E:$E,{\"ACRELI\";\"ACCHRET\";\"ACMUSUL\";\"LRELI\";\"QLCHRET\";\"QLMUSUL\";\"POLIT\"})+COUNTIFS($C:$C,\"X\",$E:$E,{\"ACRELI\";\"ACCHRET\";\"ACMUSUL\";\"LRELI\";\"QLCHRET\";\"QLMUSUL\";\"POLIT\"}))","v":0}]
[null,null,null,"GESTION",null,null,null,null,null,null,null,null,null,null,null,null,null,null,null,null,null,null,null,null,1]
[null,null,null,"Date de la première modalité remplie (Jour)","T1_DATPREMQUESTJ","A09R_T1_DATPREMQUESTJ",null,3,"donnée","dico",null,"",null,null,"","","","","","","",null,"GESTION"]
[null,null,null,"Date de la première modalité remplie (Mois)","T1_DATPREMQUESTM","A09R_T1_DATPREMQUESTM",null,4,"donnée","dico",null,"",null,null,"","","","","","","",null,"GESTION"]
[null,null,null,"Date de la première modalité remplie (Année)","T1_DATPREMQUESTA","A09R_T1_DATPREMQUESTA",null,5,"donnée","dico",null,"",null,null,"","","","","","","",null,"GESTION"]
[null,null,null,"Date de la dernière modalité remplie (Jour)","T1_DATDERQUESTJ","A09R_T1_DATDERQUESTJ",null,6,"donnée","dico",null,"",null,null,"","","","","","","",null,"GESTION"]
[null,null,null,"Date de la dernière modalité remplie (Mois)","T1_DATDERQUESTM","A09R_T1_DATDERQUESTM",null,7,"donnée","dico",null,"",null,null,"","","","","","","",null,"GESTION"]
[null,null,null,"Date de la dernière modalité remplie (Année)","T1_DATDERQUESTA","A09R_T1_DATDERQUESTA",null,8,"donnée","dico",null,"",null,null,"","","","","","","",null,"GESTION",null,0]
[null,null,null,"SITUATION FAMILIALE ET LOGEMENT",null,null,null,null,null,null,null,null,null,null,null,null,null,null,null,null,null,null,null,null,1]
[null,null,null,"Pouvez-vous nous indiquer si vous êtes parents de jumeaux, triplés ou quadruplés nés en 2011 ?","T1_JU01","A09R_T1_JU01",null,9,"donnée","dico",null,"E9AREF_YORN",null,null,"","","","","","","",null,"SITUATION FAMILIALE ET LOGEMENT"]
[null,null,null,"Est-ce votre premier questionnaire ?","T1_JU02","A09R_T1_JU02",null,10,"donnée","dico",null,"E9AREF_YORN",null,null,"","","","","","","",null,"SITUATION FAMILIALE ET LOGEMENT"]
[null,null,null,"Indiquez le prénom de l’enfant pour lequel vous remplissez ce questionnaire :","T1_JU03","A09R_T1_JU03",null,11,"non-disponible","text",null,"",null,null,"","","","","","","",null,"SITUATION FAMILIALE ET LOGEMENT"]
[null,null,null,"Vous êtes :","T1_FOYERQ01","A09R_T1_FOYERQ01",null,12,"donnée","dico",null,"E9AREF_FOYER1F",null,null,"","","","","","","",null,"SITUATION FAMILIALE ET LOGEMENT"]
[null,null,null,"Avec qui habite cet enfant (né en 2011) en ce moment ?","T1_FOYERQ02","A09R_T1_FOYERQ02",null,13,"donnée","dico",null,"E9AREF_FOYER2F",null,null,"","","","","","","",null,"SITUATION FAMILIALE ET LOGEMENT"]
[null,null,null,"Depuis le début du confinement, votre enfant habite-t-il régulièrement avec vous ?","T1_FOYERQ02BIS","A09R_T1_FOYERQ02BIS",null,14,"donnée","dico",null,"E9AREF_FOYER7F",null,null,"","","","","","","",null,"SITUATION FAMILIALE ET LOGEMENT"]
[null,null,null,"Avez-vous actuellement un.e conjoint.e présent.e dans ce logement ?","T1_FOYERQ03","A09R_T1_FOYERQ03",null,15,"donnée","dico",null,"E9AREF_YORN",null,null,"","","","","","","",null,"SITUATION FAMILIALE ET LOGEMENT"]
[null,null,null,"Habitez-vous actuellement dans votre logement habituel ?","T1_FOYERQ04","A09R_T1_FOYERQ04",null,16,"donnée","dico",null,"E9AREF_YORN",null,null,"","","","","","","",null,"SITUATION FAMILIALE ET LOGEMENT"]
[null,null,null,"Où habitez-vous en ce moment ?","T1_FOYERQ05","A09R_T1_FOYERQ05",null,17,"donnée","dico",null,"E9AREF_FOYER3F",null,null,"","","","","","","",null,"SITUATION FAMILIALE ET LOGEMENT"]
[null,null,null,"Quel est le département de votre logement actuel ?","T1_FOYERQ06","A09R_T1_FOYERQ06",null,18,"non-disponible","text",null,"E9AREF_DEPARTEMENT",null,null,"","","","","","","",null,"SITUATION FAMILIALE ET LOGEMENT"]
[null,null,null,"Dernier département d'habitation connu","T1_DEPHAB","A09R_T1_DEPHAB",null,19,"non-disponible","text",null,"E9AREF_DEPARTEMENT",null,null,"","","","","","","",null,"SITUATION FAMILIALE ET LOGEMENT"]
[null,null,null,"Vous habitez en ce moment ?","T1_FOYERQ07","A09R_T1_FOYERQ07",null,20,"donnée","dico",null,"E9AREF_FOYER6F",null,null,"","","","","","","",null,"SITUATION FAMILIALE ET LOGEMENT"]
[null,null,null,"Votre logement actuel est :","T1_FOYERQ08","A09R_T1_FOYERQ08",null,21,"donnée","dico",null,"E9AREF_FOYER4F",null,null,"","","","","","","",null,"SITUATION FAMILIALE ET LOGEMENT"]
[null,null,null,"Disposez-vous d’une cour ou d’un jardin privatif ?","T1_FOYERQ09","A09R_T1_FOYERQ09",null,22,"donnée","dico",null,"E9AREF_YORN",null,null,"","","","","","","",null,"SITUATION FAMILIALE ET LOGEMENT"]
[null,null,null,"Disposez-vous d’un balcon ou d’une terrasse ?","T1_FOYERQ10","A09R_T1_FOYERQ10",null,23,"donnée","dico",null,"E9AREF_YORN",null,null,"","","","","","","",null,"SITUATION FAMILIALE ET LOGEMENT"]
[null,null,null,"Disposez-vous d’une cour ou d’un jardin collectif ?","T1_FOYERQ11","A09R_T1_FOYERQ11",null,24,"donnée","dico",null,"E9AREF_YORN",null,null,"","","","","","","",null,"SITUATION FAMILIALE ET LOGEMENT"]
[null,null,null,"Quel est le nombre de pièces du logement que vous occupez aujourd’hui (sans compter la cuisine et la salle de bain) ?","T1_FOYERQ12","A09R_T1_FOYERQ12",null,25,"donnée","dico",null,"",null,null,"","","","","","","",null,"SITUATION FAMILIALE ET LOGEMENT"]
[null,null,null,"Combien de personnes vivent actuellement dans ce logement, y compris vous-même ?","T1_FOYERQ13","A09R_T1_FOYERQ13",null,26,"donnée","dico",null,"",null,null,"","","","","","","",null,"SITUATION FAMILIALE ET LOGEMENT"]
[null,null,null,"Parmi elles, combien votre enfant a-t-il de frères/sœurs, demi-frères/sœurs (ou enfant(s) issu(s) d’une autre union) ?","T1_FOYERQ14","A09R_T1_FOYERQ14",null,27,"donnée","dico",null,"",null,null,"","","","","","","",null,"SITUATION FAMILIALE ET LOGEMENT"]
[null,null,null,"Quel est l’âge du plus âgé de ces enfants ?","T1_FOYERQ15","A09R_T1_FOYERQ15",null,28,"donnée","dico",null,"",null,null,"","","","","","","",null,"SITUATION FAMILIALE ET LOGEMENT"]
[null,null,null,"Quel est l’âge du plus jeune de ces enfants ?","T1_FOYERQ16","A09R_T1_FOYERQ16",null,29,"donnée","dico",null,"",null,null,"","","","","","","",null,"SITUATION FAMILIALE ET LOGEMENT"]
[null,null,null,"Quel est l’âge de cet autre enfant ?","T1_FOYERQ17","A09R_T1_FOYERQ17",null,30,"donnée","dico",null,"",null,null,"","","","","","","",null,"SITUATION FAMILIALE ET LOGEMENT"]
[null,null,null,"Suite au confinement, une ou plusieurs personnes vous ont-elles rejoint.e (qui habituellement vivent ailleurs) ?","T1_FOYERQ18","A09R_T1_FOYERQ18",null,31,"donnée","dico",null,"E9AREF_YORN",null,null,"","","","","","","",null,"SITUATION FAMILIALE ET LOGEMENT"]
[null,null,null,"Quel est son/leurs lien(s) avec votre enfant ? L’autre parent","T1_FOYERQ19M_A","A09R_T1_FOYERQ19M_A",null,32,"donnée","dico",null,"E9AREF_COCHE",null,null,"","","","","","","",null,"SITUATION FAMILIALE ET LOGEMENT"]
[null,null,null,"Quel est son/leurs lien(s) avec votre enfant ? Frère(s)/Sœur(s) (ou demi-frère/sœur)","T1_FOYERQ19M_B","A09R_T1_FOYERQ19M_B",null,33,"donnée","dico",null,"E9AREF_COCHE",null,null,"","","","","","","",null,"SITUATION FAMILIALE ET LOGEMENT"]
[null,null,null,"Quel est son/leurs lien(s) avec votre enfant ? Grand(s)-parent(s)","T1_FOYERQ19M_C","A09R_T1_FOYERQ19M_C",null,34,"donnée","dico",null,"E9AREF_COCHE",null,null,"","","","","","","",null,"SITUATION FAMILIALE ET LOGEMENT"]
[null,null,null,"Quel est son/leurs lien(s) avec votre enfant ? Autre membre de la famille","T1_FOYERQ19M_D","A09R_T1_FOYERQ19M_D",null,35,"donnée","dico",null,"E9AREF_COCHE",null,null,"","","","","","","",null,"SITUATION FAMILIALE ET LOGEMENT"]
[null,null,null,"Quel est son/leurs lien(s) avec votre enfant ? Personne sans lien de parenté","T1_FOYERQ19M_E","A09R_T1_FOYERQ19M_E",null,36,"donnée","dico",null,"E9AREF_COCHE",null,null,"","","","","","","",null,"SITUATION FAMILIALE ET LOGEMENT"]
[null,null,null,"Suite au confinement, une ou plusieurs personnes qui vivent habituellement dans ce logement, l’ont-elles quitté ?","T1_FOYERQ20","A09R_T1_FOYERQ20",null,37,"donnée","dico",null,"E9AREF_YORN",null,null,"","","","","","","",null,"SITUATION FAMILIALE ET LOGEMENT"]
[null,null,null,"Quel est son/leurs lien(s) avec votre enfant ? L’autre parent","T1_FOYERQ21M_A","A09R_T1_FOYERQ21M_A",null,38,"donnée","dico",null,"E9AREF_COCHE",null,null,"","","","","","","",null,"SITUATION FAMILIALE ET LOGEMENT"]
[null,null,null,"Quel est son/leurs lien(s) avec votre enfant ? Frère(s)/Sœur(s) (ou demi-frère/sœur)","T1_FOYERQ21M_B","A09R_T1_FOYERQ21M_B",null,39,"donnée","dico",null,"E9AREF_COCHE",null,null,"","","","","","","",null,"SITUATION FAMILIALE ET LOGEMENT"]
[null,null,null,"Quel est son/leurs lien(s) avec votre enfant ? Grand(s)-parent(s)","T1_FOYERQ21M_C","A09R_T1_FOYERQ21M_C",null,40,"donnée","dico",null,"E9AREF_COCHE",null,null,"","","","","","","",null,"SITUATION FAMILIALE ET LOGEMENT"]
[null,null,null,"Quel est son/leurs lien(s) avec votre enfant ? Autre membre de la famille","T1_FOYERQ21M_D","A09R_T1_FOYERQ21M_D",null,41,"donnée","dico",null,"E9AREF_COCHE",null,null,"","","","","","","",null,"SITUATION FAMILIALE ET LOGEMENT"]
[null,null,null,"Quel est son/leurs lien(s) avec votre enfant ? Personne sans lien de parenté","T1_FOYERQ21M_E","A09R_T1_FOYERQ21M_E",null,42,"donnée","dico",null,"E9AREF_COCHE",null,null,"","","","","","","",null,"SITUATION FAMILIALE ET LOGEMENT",null,0]
[null,null,null,"SANTÉ DE L’ENFANT",null,null,null,null,null,null,null,null,null,null,null,null,null,null,null,null,null,null,null,null,1]
[null,null,null,"Votre enfant a-t-il une maladie chronique et/ou des difficultés dans son développement, c’est-à-dire une maladie ou une difficulté qui dure depuis au moins 6 mois et qui peut nécessiter des soins ou un traitement réguliers ?","T1_SANTEQ01","A09R_T1_SANTEQ01",null,43,"donnée","dico",null,"E9AREF_YORN_NSP_F",null,null,"","","","","","","",null,"SANTÉ DE L’ENFANT"]
[null,null,null,"De quelle(s) maladie(s) ou difficulté(s) s’agit-il ? Asthme ou autre maladie respiratoire","T1_SANTEQ02M_A","A09R_T1_SANTEQ02M_A",null,44,"donnée","dico",null,"E9AREF_COCHE",null,null,"","","","","","","",null,"SANTÉ DE L’ENFANT"]
[null,null,null,"De quelle(s) maladie(s) ou difficulté(s) s’agit-il ? Maladie ou malformation cardiaques","T1_SANTEQ02M_B","A09R_T1_SANTEQ02M_B",null,45,"donnée","dico",null,"E9AREF_COCHE",null,null,"","","","","","","",null,"SANTÉ DE L’ENFANT"]
[null,null,null,"De quelle(s) maladie(s) ou difficulté(s) s’agit-il ? Diabète","T1_SANTEQ02M_C","A09R_T1_SANTEQ02M_C",null,46,"donnée","dico",null,"E9AREF_COCHE",null,null,"","","","","","","",null,"SANTÉ DE L’ENFANT"]
[null,null,null,"De quelle(s) maladie(s) ou difficulté(s) s’agit-il ? Cancer","T1_SANTEQ02M_D","A09R_T1_SANTEQ02M_D",null,47,"donnée","dico",null,"E9AREF_COCHE",null,null,"","","","","","","",null,"SANTÉ DE L’ENFANT"]
[null,null,null,"De quelle(s) maladie(s) ou difficulté(s) s’agit-il ? Autres causes d’immunodépression (corticoïdes au long cours, …)","T1_SANTEQ02M_E","A09R_T1_SANTEQ02M_E",null,48,"donnée","dico",null,"E9AREF_COCHE",null,null,"","","","","","","",null,"SANTÉ DE L’ENFANT"]
[null,null,null,"De quelle(s) maladie(s) ou difficulté(s) s’agit-il ? Retard de croissance (traité par hormone de croissance)","T1_SANTEQ02M_F","A09R_T1_SANTEQ02M_F",null,49,"donnée","dico",null,"E9AREF_COCHE",null,null,"","","","","","","",null,"SANTÉ DE L’ENFANT"]
[null,null,null,"De quelle(s) maladie(s) ou difficulté(s) s’agit-il ? Troubles du comportement (autisme, hyperactivité, anxiété, syndrome dépressif)","T1_SANTEQ02M_G","A09R_T1_SANTEQ02M_G",null,50,"donnée","dico",null,"E9AREF_COCHE",null,null,"","","","","","","",null,"SANTÉ DE L’ENFANT"]
[null,null,null,"De quelle(s) maladie(s) ou difficulté(s) s’agit-il ? Difficultés dans le développement neurologique (paralysie cérébrale, retard psychomoteur, retard de langage, dyslexie, autres troubles dys, troubles des apprentissages)","T1_SANTEQ02M_H","A09R_T1_SANTEQ02M_H",null,51,"donnée","dico",null,"E9AREF_COCHE",null,null,"","","","","","","",null,"SANTÉ DE L’ENFANT"]
[null,null,null,"De quelle(s) maladie(s) ou difficulté(s) s’agit-il ? Autre(s)","T1_SANTEQ02M_I","A09R_T1_SANTEQ02M_I",null,52,"donnée","dico",null,"E9AREF_COCHE",null,null,"","","","","","","",null,"SANTÉ DE L’ENFANT"]
[null,null,null,"Avez-vous la possibilité de peser votre enfant sur une balance ?","T1_SANTEQPDS","A09R_T1_SANTEQPDS",null,53,"donnée","dico",null,"E9AREF_YORN",null,null,"","","","","","","",null,"SANTÉ DE L’ENFANT"]
[null,null,null,"Quel est le poids de votre enfant en kg ?","T1_SANTEQPDS1","A09R_T1_SANTEQPDS1",null,54,"donnée","dico",null,"",null,null,"","","","","","","",null,"SANTÉ DE L’ENFANT"]
[null,null,null,"Votre enfant a-t-il eu de la toux ou de la fièvre il y a plus de 15 jours ?","T1_SANTEQ03","A09R_T1_SANTEQ03",null,55,"donnée","dico",null,"E9AREF_YORN",null,null,"","","","","","","",null,"SANTÉ DE L’ENFANT"]
[null,null,null,"Ces symptômes ont-ils commencé ?","T1_SANTEQ04","A09R_T1_SANTEQ04",null,56,"donnée","dico",null,"E9AREF_SANTE2F",null,null,"","","","","","","",null,"SANTÉ DE L’ENFANT"]
[null,null,null,"Votre enfant a-t-il été testé positif pour le coronavirus il y a plus de 15 jours ?","T1_SANTEQ05","A09R_T1_SANTEQ05",null,57,"donnée","dico",null,"E9AREF_YORN",null,null,"","","","","","","",null,"SANTÉ DE L’ENFANT"]
[null,null,null,"Une autre personne vivant avec vous actuellement a-t-elle été testée positive pour le coronavirus il y a plus de 15 jours ?","T1_SANTEQ06","A09R_T1_SANTEQ06",null,58,"donnée","dico",null,"E9AREF_YORN",null,null,"","","","","","","",null,"SANTÉ DE L’ENFANT"]
[null,null,null,"Au cours des 15 derniers jours , en dehors de votre enfant né en 2011, au moins une personne habitant votre logement, y compris vous-même a-t-elle présenté de la toux ou de la fièvre ?","T1_SANTEQ07","A09R_T1_SANTEQ07",null,59,"donnée","dico",null,"E9AREF_YORN",null,null,"","","","","","","",null,"SANTÉ DE L’ENFANT"]
[null,null,null,"Au cours des 15 derniers jours , en dehors de votre enfant né en 2011, au moins une personne habitant votre logement, y compris vous-même a-t-elle été testée positive au coronavirus ?","T1_SANTEQ08","A09R_T1_SANTEQ08",null,60,"donnée","dico",null,"E9AREF_YORN",null,null,"","","","","","","",null,"SANTÉ DE L’ENFANT"]
[null,null,null,"Vous-même, êtes-vous concerné.e par ces symptômes ou cette infection ?","T1_SANTEQ08A","A09R_T1_SANTEQ08A",null,61,"donnée","dico",null,"E9AREF_YORN",null,null,"","","","","","","",null,"SANTÉ DE L’ENFANT"]
[null,null,null,"Comment allez-vous aujourd’hui ?","T1_SANTEQ08B","A09R_T1_SANTEQ08B",null,62,"donnée","dico",null,"E9AREF_SANTE4F",null,null,"","","","","","","",null,"SANTÉ DE L’ENFANT"]
[null,null,null,"D’autres personnes habitant dans votre logement sont-elles concernées par ces symptômes ou cette infection ?","T1_SANTEQ08ABIS","A09R_T1_SANTEQ08ABIS",null,63,"donnée","dico",null,"E9AREF_SANTE31F",null,null,"","","","","","","",null,"SANTÉ DE L’ENFANT"]
[null,null,null,"Quelle(s) personne(s) est ou sont concernée(s) ? Votre conjoint.e","T1_SANTEQ08M_A","A09R_T1_SANTEQ08M_A",null,64,"donnée","dico",null,"E9AREF_COCHE",null,null,"","","","","","","",null,"SANTÉ DE L’ENFANT"]
[null,null,null,"Quelle(s) personne(s) est ou sont concernée(s) ? Frère/demi-frère, sœur/demi-sœur de l’enfant Elfe","T1_SANTEQ08M_B","A09R_T1_SANTEQ08M_B",null,65,"donnée","dico",null,"E9AREF_COCHE",null,null,"","","","","","","",null,"SANTÉ DE L’ENFANT"]
[null,null,null,"Quelle(s) personne(s) est ou sont concernée(s) ? Autre personne","T1_SANTEQ08M_C","A09R_T1_SANTEQ08M_C",null,66,"donnée","dico",null,"E9AREF_COCHE",null,null,"","","","","","","",null,"SANTÉ DE L’ENFANT"]
[null,null,null,"Comment cette personne va-t-elle aujourd’hui ?","T1_SANTEQ08C","A09R_T1_SANTEQ08C",null,67,"donnée","dico",null,"E9AREF_SANTE5F",null,null,"","","","","","","",null,"SANTÉ DE L’ENFANT"]
[null,null,null,"Comment ces personnes vont-elles aujourd’hui ?","T1_SANTEQ08D","A09R_T1_SANTEQ08D",null,68,"donnée","dico",null,"E9AREF_SANTE6F",null,null,"","","","","","","",null,"SANTÉ DE L’ENFANT"]
[null,null,null,"Au cours des 15 derniers jours, y compris aujourd’hui, a-t-il présenté le symptôme suivant qu’il n’a pas habituellement? Fièvre ou sensation de fièvre","T1_SANTEQ09_S01","A09R_T1_SANTEQ09_S01",null,69,"donnée","dico",null,"E9AREF_YORN",null,null,"","","","","","","",null,"SANTÉ DE L’ENFANT"]
[null,null,null,"Le symptôme est-il encore présent aujourd’hui ? Fièvre ou sensation de fièvre","T1_SANTEQ09_S01O","A09R_T1_SANTEQ09_S01O",null,70,"donnée","dico",null,"E9AREF_YORN",null,null,"","","","","","","",null,"SANTÉ DE L’ENFANT"]
[null,null,null,"Combien de temps environ a duré ce symptôme ? Fièvre ou sensation de fièvre","T1_SANTEQ09_S01N","A09R_T1_SANTEQ09_S01N",null,71,"donnée","dico",null,"E9AREF_SANTE7F",null,null,"","","","","","","",null,"SANTÉ DE L’ENFANT"]
[null,null,null,"Au cours des 15 derniers jours, y compris aujourd’hui, a-t-il présenté le symptôme suivant qu’il n’a pas habituellement? Mal à la tête","T1_SANTEQ09_S02","A09R_T1_SANTEQ09_S02",null,72,"donnée","dico",null,"E9AREF_YORN",null,null,"","","","","","","",null,"SANTÉ DE L’ENFANT"]
[null,null,null,"Le symptôme est-il encore présent aujourd’hui ? Mal à la tête","T1_SANTEQ09_S02O","A09R_T1_SANTEQ09_S02O",null,73,"donnée","dico",null,"E9AREF_YORN",null,null,"","","","","","","",null,"SANTÉ DE L’ENFANT"]
[null,null,null,"Combien de temps environ a duré ce symptôme ? Mal à la tête","T1_SANTEQ09_S02N","A09R_T1_SANTEQ09_S02N",null,74,"donnée","dico",null,"E9AREF_SANTE7F",null,null,"","","","","","","",null,"SANTÉ DE L’ENFANT"]
[null,null,null,"Au cours des 15 derniers jours, y compris aujourd’hui, a-t-il présenté le symptôme suivant qu’il n’a pas habituellement? Fatigue inhabituelle","T1_SANTEQ09_S03","A09R_T1_SANTEQ09_S03",null,75,"donnée","dico",null,"E9AREF_YORN",null,null,"","","","","","","",null,"SANTÉ DE L’ENFANT"]
[null,null,null,"Le symptôme est-il encore présent aujourd’hui ? Fatigue inhabituelle","T1_SANTEQ09_S03O","A09R_T1_SANTEQ09_S03O",null,76,"donnée","dico",null,"E9AREF_YORN",null,null,"","","","","","","",null,"SANTÉ DE L’ENFANT"]
[null,null,null,"Combien de temps environ a duré ce symptôme ? Fatigue inhabituelle","T1_SANTEQ09_S03N","A09R_T1_SANTEQ09_S03N",null,77,"donnée","dico",null,"E9AREF_SANTE7F",null,null,"","","","","","","",null,"SANTÉ DE L’ENFANT"]
[null,null,null,"Au cours des 15 derniers jours, y compris aujourd’hui, a-t-il présenté le symptôme suivant qu’il n’a pas habituellement? Courbatures, douleurs musculaires","T1_SANTEQ09_S04","A09R_T1_SANTEQ09_S04",null,78,"donnée","dico",null,"E9AREF_YORN",null,null,"","","","","","","",null,"SANTÉ DE L’ENFANT"]
[null,null,null,"Le symptôme est-il encore présent aujourd’hui ? Courbatures, douleurs musculaires","T1_SANTEQ09_S04O","A09R_T1_SANTEQ09_S04O",null,79,"donnée","dico",null,"E9AREF_YORN",null,null,"","","","","","","",null,"SANTÉ DE L’ENFANT"]
[null,null,null,"Combien de temps environ a duré ce symptôme ? Courbatures, douleurs musculaires","T1_SANTEQ09_S04N","A09R_T1_SANTEQ09_S04N",null,80,"donnée","dico",null,"E9AREF_SANTE7F",null,null,"","","","","","","",null,"SANTÉ DE L’ENFANT"]
[null,null,null,"Au cours des 15 derniers jours, y compris aujourd’hui, a-t-il présenté le symptôme suivant qu’il n’a pas habituellement? Toux","T1_SANTEQ09_S05","A09R_T1_SANTEQ09_S05",null,81,"donnée","dico",null,"E9AREF_YORN",null,null,"","","","","","","",null,"SANTÉ DE L’ENFANT"]
[null,null,null,"Le symptôme est-il encore présent aujourd’hui ? Toux","T1_SANTEQ09_S05O","A09R_T1_SANTEQ09_S05O",null,82,"donnée","dico",null,"E9AREF_YORN",null,null,"","","","","","","",null,"SANTÉ DE L’ENFANT"]
[null,null,null,"Combien de temps environ a duré ce symptôme ? Toux","T1_SANTEQ09_S05N","A09R_T1_SANTEQ09_S05N",null,83,"donnée","dico",null,"E9AREF_SANTE7F",null,null,"","","","","","","",null,"SANTÉ DE L’ENFANT"]
[null,null,null,"Au cours des 15 derniers jours, y compris aujourd’hui, a-t-il présenté le symptôme suivant qu’il n’a pas habituellement? Difficultés respiratoires, essoufflement inhabituel","T1_SANTEQ09_S06","A09R_T1_SANTEQ09_S06",null,84,"donnée","dico",null,"E9AREF_YORN",null,null,"","","","","","","",null,"SANTÉ DE L’ENFANT"]
[null,null,null,"Le symptôme est-il encore présent aujourd’hui ? Difficultés respiratoires, essoufflement inhabituel","T1_SANTEQ09_S06O","A09R_T1_SANTEQ09_S06O",null,85,"donnée","dico",null,"E9AREF_YORN",null,null,"","","","","","","",null,"SANTÉ DE L’ENFANT"]
[null,null,null,"Combien de temps environ a duré ce symptôme ? Difficultés respiratoires, essoufflement inhabituel","T1_SANTEQ09_S06N","A09R_T1_SANTEQ09_S06N",null,86,"donnée","dico",null,"E9AREF_SANTE7F",null,null,"","","","","","","",null,"SANTÉ DE L’ENFANT"]
[null,null,null,"Au cours des 15 derniers jours, y compris aujourd’hui, a-t-il présenté le symptôme suivant qu’il n’a pas habituellement? Nez qui coule","T1_SANTEQ09_S07","A09R_T1_SANTEQ09_S07",null,87,"donnée","dico",null,"E9AREF_YORN",null,null,"","","","","","","",null,"SANTÉ DE L’ENFANT"]
[null,null,null,"Le symptôme est-il encore présent aujourd’hui ? Nez qui coule","T1_SANTEQ09_S07O","A09R_T1_SANTEQ09_S07O",null,88,"donnée","dico",null,"E9AREF_YORN",null,null,"","","","","","","",null,"SANTÉ DE L’ENFANT"]
[null,null,null,"Combien de temps environ a duré ce symptôme ? Nez qui coule","T1_SANTEQ09_S07N","A09R_T1_SANTEQ09_S07N",null,89,"donnée","dico",null,"E9AREF_SANTE7F",null,null,"","","","","","","",null,"SANTÉ DE L’ENFANT"]
[null,null,null,"Au cours des 15 derniers jours, y compris aujourd’hui, a-t-il présenté le symptôme suivant qu’il n’a pas habituellement? Mal à la gorge (Pharyngite, angine)","T1_SANTEQ09_S071","A09R_T1_SANTEQ09_S071",null,90,"donnée","dico",null,"E9AREF_YORN",null,null,"","","","","","","",null,"SANTÉ DE L’ENFANT"]
[null,null,null,"Le symptôme est-il encore présent aujourd’hui ? Mal à la gorge (Pharyngite, angine)","T1_SANTEQ09_S071O","A09R_T1_SANTEQ09_S071O",null,91,"donnée","dico",null,"E9AREF_YORN",null,null,"","","","","","","",null,"SANTÉ DE L’ENFANT"]
[null,null,null,"Combien de temps environ a duré ce symptôme ? Mal à la gorge (Pharyngite, angine)","T1_SANTEQ09_S071N","A09R_T1_SANTEQ09_S071N",null,92,"donnée","dico",null,"E9AREF_SANTE7F",null,null,"","","","","","","",null,"SANTÉ DE L’ENFANT"]
[null,null,null,"Au cours des 15 derniers jours, y compris aujourd’hui, a-t-il présenté le symptôme suivant qu’il n’a pas habituellement? Conjonctivite accompagnée de fièvre","T1_SANTEQ09_S072","A09R_T1_SANTEQ09_S072",null,93,"donnée","dico",null,"E9AREF_YORN",null,null,"","","","","","","",null,"SANTÉ DE L’ENFANT"]
[null,null,null,"Le symptôme est-il encore présent aujourd’hui ? Conjonctivite accompagnée de fièvre","T1_SANTEQ09_S072O","A09R_T1_SANTEQ09_S072O",null,94,"donnée","dico",null,"E9AREF_YORN",null,null,"","","","","","","",null,"SANTÉ DE L’ENFANT"]
[null,null,null,"Combien de temps environ a duré ce symptôme ? Conjonctivite accompagnée de fièvre","T1_SANTEQ09_S072N","A09R_T1_SANTEQ09_S072N",null,95,"donnée","dico",null,"E9AREF_SANTE7F",null,null,"","","","","","","",null,"SANTÉ DE L’ENFANT"]
[null,null,null,"Au cours des 15 derniers jours, y compris aujourd’hui, a-t-il présenté le symptôme suivant qu’il n’a pas habituellement? Troubles du goût ou de l’odorat","T1_SANTEQ09_S08","A09R_T1_SANTEQ09_S08",null,96,"donnée","dico",null,"E9AREF_YORN",null,null,"","","","","","","",null,"SANTÉ DE L’ENFANT"]
[null,null,null,"Le symptôme est-il encore présent aujourd’hui ? Troubles du goût ou de l’odorat","T1_SANTEQ09_S08O","A09R_T1_SANTEQ09_S08O",null,97,"donnée","dico",null,"E9AREF_YORN",null,null,"","","","","","","",null,"SANTÉ DE L’ENFANT"]
[null,null,null,"Combien de temps environ a duré ce symptôme ? Troubles du goût ou de l’odorat","T1_SANTEQ09_S08N","A09R_T1_SANTEQ09_S08N",null,98,"donnée","dico",null,"E9AREF_SANTE7F",null,null,"","","","","","","",null,"SANTÉ DE L’ENFANT"]
[null,null,null,"Au cours des 15 derniers jours, y compris aujourd’hui, a-t-il présenté le symptôme suivant qu’il n’a pas habituellement? Mal au ventre, douleurs abdominales","T1_SANTEQ09_S081","A09R_T1_SANTEQ09_S081",null,99,"donnée","dico",null,"E9AREF_YORN",null,null,"","","","","","","",null,"SANTÉ DE L’ENFANT"]
[null,null,null,"Le symptôme est-il encore présent aujourd’hui ? Mal au ventre, douleurs abdominales","T1_SANTEQ09_S081O","A09R_T1_SANTEQ09_S081O",null,100,"donnée","dico",null,"E9AREF_YORN",null,null,"","","","","","","",null,"SANTÉ DE L’ENFANT"]
[null,null,null,"Combien de temps environ a duré ce symptôme ? Mal au ventre, douleurs abdominales","T1_SANTEQ09_S081N","A09R_T1_SANTEQ09_S081N",null,101,"donnée","dico",null,"E9AREF_SANTE7F",null,null,"","","","","","","",null,"SANTÉ DE L’ENFANT"]
[null,null,null,"Au cours des 15 derniers jours, y compris aujourd’hui, a-t-il présenté le symptôme suivant qu’il n’a pas habituellement? Nausées, vomissements","T1_SANTEQ09_S09","A09R_T1_SANTEQ09_S09",null,102,"donnée","dico",null,"E9AREF_YORN",null,null,"","","","","","","",null,"SANTÉ DE L’ENFANT"]
[null,null,null,"Le symptôme est-il encore présent aujourd’hui ? Nausées, vomissements","T1_SANTEQ09_S09O","A09R_T1_SANTEQ09_S09O",null,103,"donnée","dico",null,"E9AREF_YORN",null,null,"","","","","","","",null,"SANTÉ DE L’ENFANT"]
[null,null,null,"Combien de temps environ a duré ce symptôme ? Nausées, vomissements","T1_SANTEQ09_S09N","A09R_T1_SANTEQ09_S09N",null,104,"donnée","dico",null,"E9AREF_SANTE7F",null,null,"","","","","","","",null,"SANTÉ DE L’ENFANT"]
[null,null,null,"Au cours des 15 derniers jours, y compris aujourd’hui, a-t-il présenté le symptôme suivant qu’il n’a pas habituellement? Diarrhée","T1_SANTEQ09_S10","A09R_T1_SANTEQ09_S10",null,105,"donnée","dico",null,"E9AREF_YORN",null,null,"","","","","","","",null,"SANTÉ DE L’ENFANT"]
[null,null,null,"Le symptôme est-il encore présent aujourd’hui ? Diarrhée","T1_SANTEQ09_S10O","A09R_T1_SANTEQ09_S10O",null,106,"donnée","dico",null,"E9AREF_YORN",null,null,"","","","","","","",null,"SANTÉ DE L’ENFANT"]
[null,null,null,"Combien de temps environ a duré ce symptôme ? Diarrhée","T1_SANTEQ09_S10N","A09R_T1_SANTEQ09_S10N",null,107,"donnée","dico",null,"E9AREF_SANTE7F",null,null,"","","","","","","",null,"SANTÉ DE L’ENFANT"]
[null,null,null,"Au cours des 15 derniers jours, y compris aujourd’hui, a-t-il présenté le symptôme suivant qu’il n’a pas habituellement? Douleurs thoraciques, oppression","T1_SANTEQ09_S11","A09R_T1_SANTEQ09_S11",null,108,"donnée","dico",null,"E9AREF_YORN",null,null,"","","","","","","",null,"SANTÉ DE L’ENFANT"]
[null,null,null,"Le symptôme est-il encore présent aujourd’hui ? Douleurs thoraciques, oppression","T1_SANTEQ09_S11O","A09R_T1_SANTEQ09_S11O",null,109,"donnée","dico",null,"E9AREF_YORN",null,null,"","","","","","","",null,"SANTÉ DE L’ENFANT"]
[null,null,null,"Combien de temps environ a duré ce symptôme ? Douleurs thoraciques, oppression","T1_SANTEQ09_S11N","A09R_T1_SANTEQ09_S11N",null,110,"donnée","dico",null,"E9AREF_SANTE7F",null,null,"","","","","","","",null,"SANTÉ DE L’ENFANT"]
[null,null,null,"Au cours des 15 derniers jours, y compris aujourd’hui, a-t-il présenté le symptôme suivant qu’il n’a pas habituellement? Apparition de rougeurs, engelures, plaques persistantes sur les mains, les pieds ou le visage","T1_SANTEQ09_S12","A09R_T1_SANTEQ09_S12",null,111,"donnée","dico",null,"E9AREF_YORN",null,null,"","","","","","","",null,"SANTÉ DE L’ENFANT"]
[null,null,null,"Le symptôme est-il encore présent aujourd’hui ? Apparition de rougeurs, engelures, plaques persistantes sur les mains, les pieds ou le visage","T1_SANTEQ09_S12O","A09R_T1_SANTEQ09_S12O",null,112,"donnée","dico",null,"E9AREF_YORN",null,null,"","","","","","","",null,"SANTÉ DE L’ENFANT"]
[null,null,null,"Combien de temps environ a duré ce symptôme ? Apparition de rougeurs, engelures, plaques persistantes sur les mains, les pieds ou le visage","T1_SANTEQ09_S12N","A09R_T1_SANTEQ09_S12N",null,113,"donnée","dico",null,"E9AREF_SANTE7F",null,null,"","","","","","","",null,"SANTÉ DE L’ENFANT"]
[null,null,null,"Si votre enfant a ressenti au moins l’un de ces symptômes, depuis combien de jours le premier de ces symptômes est-il apparu? (le premier de ces symptômes a pu commencer il y a plus de 15 jours et peut ne plus être présent aujourd’hui) ?","T1_SANTEQ10","A09R_T1_SANTEQ10",null,114,"donnée","dico",null,"E9AREF_NSP",null,null,"","","","","","","",null,"SANTÉ DE L’ENFANT"]
[null,null,null,"Ces symptômes vous ont-ils fait penser que votre enfant avait peut-être le coronavirus ?","T1_SANTEQ11","A09R_T1_SANTEQ11",null,115,"donnée","dico",null,"E9AREF_YORN",null,null,"","","","","","","",null,"SANTÉ DE L’ENFANT"]
[null,null,null,"Au moment de l’apparition des premiers symptômes, qu’avez-vous fait en premier ?","T1_SANTEQ12","A09R_T1_SANTEQ12",null,116,"donnée","dico",null,"E9AREF_SANTE8F",null,null,"","","","","","","",null,"SANTÉ DE L’ENFANT"]
[null,null,null,"Pour quelle raison n’avez vous rien fait ?","T1_SANTEQ38","A09R_T1_SANTEQ38",null,117,"donnée","dico",null,"E9AREF_SANTE19F",null,null,"","","","","","","",null,"SANTÉ DE L’ENFANT"]
[null,null,null,"Avez-vous réussi à joindre ou voir un professionnel de santé ?","T1_SANTEQ13","A09R_T1_SANTEQ13",null,118,"donnée","dico",null,"E9AREF_SANTE9F",null,null,"","","","","","","",null,"SANTÉ DE L’ENFANT"]
[null,null,null,"Au cours des 15 derniers jours, combien votre enfant a-t-il eu de consultations avec un médecin hors de l’hôpital (par téléphone, par vidéo, à domicile, à son cabinet)  pour ce(s) symptôme(s) ?","T1_SANTEQ14","A09R_T1_SANTEQ14",null,119,"donnée","dico",null,"E9AREF_SANTE10F",null,null,"","","","","","","",null,"SANTÉ DE L’ENFANT"]
[null,null,null,"La première consultation de votre enfant pour ce(s) symptôme(s) , a eu lieu il y a combien de jours ?","T1_SANTEQ15","A09R_T1_SANTEQ15",null,120,"donnée","dico",null,"",null,null,"","","","","","","",null,"SANTÉ DE L’ENFANT"]
[null,null,null,"Au cours des 15 derniers jours, votre enfant a-t-il eu une ou plusieurs consultations avec un médecin de l’hôpital (urgences, consultations dans l'hôpital, téléconsultation)  pour ce(s) symptôme(s) ?","T1_SANTEQ16","A09R_T1_SANTEQ16",null,121,"donnée","dico",null,"E9AREF_SANTE10F",null,null,"","","","","","","",null,"SANTÉ DE L’ENFANT"]
[null,null,null,"La première consultation de votre enfant pour ce(s) symptôme(s) avec un médecin de l'hôpital, a eu lieu il y a combien de jours ?","T1_SANTEQ17","A09R_T1_SANTEQ17",null,122,"donnée","dico",null,"",null,null,"","","","","","","",null,"SANTÉ DE L’ENFANT"]
[null,null,null,"Au cours des 15 derniers jours,  votre enfant a-t-il été hospitalisé au moins une fois pour ce(s) symptôme(s) ?","T1_SANTEQ18","A09R_T1_SANTEQ18",null,123,"donnée","dico",null,"E9AREF_SANTE11F",null,null,"","","","","","","",null,"SANTÉ DE L’ENFANT"]
[null,null,null,"Votre enfant est entré à l'hôpital il y a combien de jours (la première fois qu’il a été hospitalisé) ?","T1_SANTEQ19","A09R_T1_SANTEQ19",null,124,"donnée","dico",null,"",null,null,"","","","","","","",null,"SANTÉ DE L’ENFANT"]
[null,null,null,"Comment  votre enfant va-t-il à présent ?","T1_SANTEQ19A","A09R_T1_SANTEQ19A",null,125,"donnée","dico",null,"E9AREF_SANTE12F",null,null,"","","","","","","",null,"SANTÉ DE L’ENFANT"]
[null,null,null,"Au cours des 15 derniers jours, avez-vous appelé le centre 15 ou les pompiers pour ce(s) symptôme(s) chez votre enfant?","T1_SANTEQ20","A09R_T1_SANTEQ20",null,126,"donnée","dico",null,"E9AREF_YORN",null,null,"","","","","","","",null,"SANTÉ DE L’ENFANT"]
[null,null,null,"Au cours des 15 derniers jours, vous a-t-on orienté.e vers un service de suivi médical en ligne (application mobile ou site internet) ?","T1_SANTEQ21","A09R_T1_SANTEQ21",null,127,"donnée","dico",null,"E9AREF_SANTE13F",null,null,"","","","","","","",null,"SANTÉ DE L’ENFANT"]
[null,null,null,"Lors de la consultation, le médecin a-t-il :","T1_SANTEQ22","A09R_T1_SANTEQ22",null,128,"donnée","dico",null,"E9AREF_SANTE14F",null,null,"","","","","","","",null,"SANTÉ DE L’ENFANT"]
[null,null,null,"Lors de la consultation, le médecin a-t-il prescrit un test pour le coronavirus à votre enfant ?","T1_SANTEQ23","A09R_T1_SANTEQ23",null,129,"donnée","dico",null,"E9AREF_SANTE32F",null,null,"","","","","","","",null,"SANTÉ DE L’ENFANT"]
[null,null,null,"Le médecin a dit :","T1_SANTEQ24","A09R_T1_SANTEQ24",null,130,"donnée","dico",null,"E9AREF_SANTE15F",null,null,"","","","","","","",null,"SANTÉ DE L’ENFANT"]
[null,null,null,"A-t-il prescrit un traitement à votre enfant ?","T1_SANTEQ25","A09R_T1_SANTEQ25",null,131,"donnée","dico",null,"E9AREF_SANTE16F",null,null,"","","","","","","",null,"SANTÉ DE L’ENFANT"]
[null,null,null,"A-t-il simplement recommandé que votre enfant reste chez vous et de faire tomber sa fièvre ou de surveiller l’évolution de ces symptômes ?","T1_SANTEQ26","A09R_T1_SANTEQ26",null,132,"donnée","dico",null,"E9AREF_YORN",null,null,"","","","","","","",null,"SANTÉ DE L’ENFANT"]
[null,null,null,"A-t-il conseillé d’aller à l’hôpital ou aux urgences ou a-t-il directement contacté l’hôpital pour ce(s) symptôme(s) chez votre enfant ?","T1_SANTEQ27","A09R_T1_SANTEQ27",null,133,"donnée","dico",null,"E9AREF_SANTE17F",null,null,"","","","","","","",null,"SANTÉ DE L’ENFANT"]
[null,null,null,"Le médecin vous a-t-il conseillé d’appeler le centre 15 ou a-t-il directement contacté le centre 15 pour ce(s) symptôme(s) chez votre enfant ?","T1_SANTEQ28","A09R_T1_SANTEQ28",null,134,"donnée","dico",null,"E9AREF_YORN",null,null,"","","","","","","",null,"SANTÉ DE L’ENFANT"]
[null,null,null,"A-t-il prescrit ou donné des masques pour votre enfant ?","T1_SANTEQ29","A09R_T1_SANTEQ29",null,135,"donnée","dico",null,"E9AREF_YORN",null,null,"","","","","","","",null,"SANTÉ DE L’ENFANT"]
[null,null,null,"Lors de votre premier appel au centre 15 (ou 18), a-t-on prescrit un test de détection du coronavirus à votre enfant?","T1_SANTEQ30","A09R_T1_SANTEQ30",null,136,"donnée","dico",null,"E9AREF_SANTE32F",null,null,"","","","","","","",null,"SANTÉ DE L’ENFANT"]
[null,null,null,"Vous a-t-on dit ?","T1_SANTEQ31","A09R_T1_SANTEQ31",null,137,"donnée","dico",null,"E9AREF_SANTE18F",null,null,"","","","","","","",null,"SANTÉ DE L’ENFANT"]
[null,null,null,"A-t-on simplement recommandé que votre enfant reste à domicile et de faire tomber sa fièvre ou de surveiller l’évolution de ces symptômes ?","T1_SANTEQ32","A09R_T1_SANTEQ32",null,138,"donnée","dico",null,"E9AREF_YORN",null,null,"","","","","","","",null,"SANTÉ DE L’ENFANT"]
[null,null,null,"Toujours lors de votre premier appel au centre 15 ou aux pompiers, a-t-on conseillé d’aller voir un médecin pour votre enfant ?","T1_SANTEQ33","A09R_T1_SANTEQ33",null,139,"donnée","dico",null,"E9AREF_YORN",null,null,"","","","","","","",null,"SANTÉ DE L’ENFANT"]
[null,null,null,"A-t-on conseillé d’aller à l’hôpital, aux urgences pour votre enfant?","T1_SANTEQ34","A09R_T1_SANTEQ34",null,140,"donnée","dico",null,"E9AREF_YORN",null,null,"","","","","","","",null,"SANTÉ DE L’ENFANT"]
[null,null,null,"Une équipe médicale s’est-elle rendue à votre domicile pour votre enfant ?","T1_SANTEQ35","A09R_T1_SANTEQ35",null,141,"donnée","dico",null,"E9AREF_YORN",null,null,"","","","","","","",null,"SANTÉ DE L’ENFANT"]
[null,null,null,"A-t-on prescrit un confinement dans le logement sans aucune sortie à votre enfant ?","T1_SANTEQ36","A09R_T1_SANTEQ36",null,142,"donnée","dico",null,"E9AREF_YORN",null,null,"","","","","","","",null,"SANTÉ DE L’ENFANT"]
[null,null,null,"A-t-on prescrit un confinement sans aucune sortie pour les autres personnes partageant le même logement ?","T1_SANTEQ37","A09R_T1_SANTEQ37",null,143,"donnée","dico",null,"E9AREF_YORN",null,null,"","","","","","","",null,"SANTÉ DE L’ENFANT"]
[null,null,null,"Avez-vous pris des mesures particulières depuis le début de ces symptômes ? Votre enfant est resté strictement confiné dans votre logement sans aucune sortie","T1_SANTEQ39M_A","A09R_T1_SANTEQ39M_A",null,144,"donnée","dico",null,"E9AREF_COCHE",null,null,"","","","","","","",null,"SANTÉ DE L’ENFANT"]
[null,null,null,"Avez-vous pris des mesures particulières depuis le début de ces symptômes ? Votre enfant a porté un masque lors de ses sorties à l’extérieur","T1_SANTEQ39M_B","A09R_T1_SANTEQ39M_B",null,145,"donnée","dico",null,"E9AREF_COCHE",null,null,"","","","","","","",null,"SANTÉ DE L’ENFANT"]
[null,null,null,"Avez-vous pris des mesures particulières depuis le début de ces symptômes ? Votre enfant a porté un masque dans le logement","T1_SANTEQ39M_C","A09R_T1_SANTEQ39M_C",null,146,"donnée","dico",null,"E9AREF_COCHE",null,null,"","","","","","","",null,"SANTÉ DE L’ENFANT"]
[null,null,null,"Avez-vous pris des mesures particulières depuis le début de ces symptômes ? Votre enfant s’est lavé les mains plus souvent","T1_SANTEQ39M_D","A09R_T1_SANTEQ39M_D",null,147,"donnée","dico",null,"E9AREF_COCHE",null,null,"","","","","","","",null,"SANTÉ DE L’ENFANT"]
[null,null,null,"Avez-vous pris des mesures particulières depuis le début de ces symptômes ? Vous avez isolé votre enfant des autres personnes qui partagent votre logement (par exemple, il a dormi seul ce qui n’est pas le cas habituellement)","T1_SANTEQ39M_E","A09R_T1_SANTEQ39M_E",null,148,"donnée","dico",null,"E9AREF_COCHE",null,null,"","","","","","","",null,"SANTÉ DE L’ENFANT"]
[null,null,null,"Avez-vous pris des mesures particulières depuis le début de ces symptômes ? Toutes les personnes du logement ont surveillé leur température régulièrement","T1_SANTEQ39M_F","A09R_T1_SANTEQ39M_F",null,149,"donnée","dico",null,"E9AREF_COCHE",null,null,"","","","","","","",null,"SANTÉ DE L’ENFANT"]
[null,null,null,"Avez-vous pris des mesures particulières depuis le début de ces symptômes ? Toutes les personnes du logement sont restées strictement confinées sans aucune sortie à l’extérieur","T1_SANTEQ39M_G","A09R_T1_SANTEQ39M_G",null,150,"donnée","dico",null,"E9AREF_COCHE",null,null,"","","","","","","",null,"SANTÉ DE L’ENFANT"]
[null,null,null,"Avez-vous pris des mesures particulières depuis le début de ces symptômes ? Vous n'avez pris aucune mesure","T1_SANTEQ39M_H","A09R_T1_SANTEQ39M_H",null,151,"donnée","dico",null,"E9AREF_COCHE",null,null,"","","","","","","",null,"SANTÉ DE L’ENFANT"]
[null,null,null,"Les personnes du logement ont-elles porté un masque ?","T1_SANTEQ39M1","A09R_T1_SANTEQ39M1",null,152,"donnée","dico",null,"E9AREF_SANTE21F",null,null,"","","","","","","",null,"SANTÉ DE L’ENFANT"]
[null,null,null,"Au cours des 15 derniers jours, votre enfant a-t-il eu besoin de consulter un professionnel de santé pour un ou plusieurs problèmes de santé non liés au coronavirus ?","T1_SANTEQ40","A09R_T1_SANTEQ40",null,153,"donnée","dico",null,"E9AREF_YORN",null,null,"","","","","","","",null,"SANTÉ DE L’ENFANT"]
[null,null,null,"Précisez :","T1_SANTEQ40P","A09R_T1_SANTEQ40P",null,154,"non-disponible","text",null,"",null,null,"","","","","","","",null,"SANTÉ DE L’ENFANT"]
[null,null,null,"Pour quelle(s) raison(s) ? - rep 1","T1_SANTEQ40M_1","A09R_T1_SANTEQ40M_1",null,359,"donnée","dico",null,"E9AREF_SANTE40M",null,null,"",null,null,null,null,null,null,null,"SANTÉ DE L’ENFANT"]
[null,null,null,"Pour quelle(s) raison(s) ? - rep 2","T1_SANTEQ40M_2","A09R_T1_SANTEQ40M_2",null,360,"donnée","dico",null,"E9AREF_SANTE40M",null,null,"",null,null,null,null,null,null,null,"SANTÉ DE L’ENFANT"]
[null,null,null,"Pour quelle(s) raison(s) ? - rep 3","T1_SANTEQ40M_3","A09R_T1_SANTEQ40M_3",null,361,"donnée","dico",null,"E9AREF_SANTE40M",null,null,"",null,null,null,null,null,null,null,"SANTÉ DE L’ENFANT"]
[null,null,null,"Au moment de ce(s) problème(s) de santé chez votre enfant qu’avez-vous fait ? Vous avez appelé un médecin","T1_SANTEQ41M_A","A09R_T1_SANTEQ41M_A",null,155,"donnée","dico",null,"E9AREF_COCHE",null,null,"","","","","","","",null,"SANTÉ DE L’ENFANT"]
[null,null,null,"Au moment de ce(s) problème(s) de santé chez votre enfant qu’avez-vous fait ? Vous avez été directement au cabinet d’un médecin pour votre enfant","T1_SANTEQ41M_B","A09R_T1_SANTEQ41M_B",null,156,"donnée","dico",null,"E9AREF_COCHE",null,null,"","","","","","","",null,"SANTÉ DE L’ENFANT"]
[null,null,null,"Au moment de ce(s) problème(s) de santé chez votre enfant qu’avez-vous fait ? Vous avez appelé le centre 15","T1_SANTEQ41M_C","A09R_T1_SANTEQ41M_C",null,157,"donnée","dico",null,"E9AREF_COCHE",null,null,"","","","","","","",null,"SANTÉ DE L’ENFANT"]
[null,null,null,"Au moment de ce(s) problème(s) de santé chez votre enfant qu’avez-vous fait ? Vous avez appelé les pompiers (18)","T1_SANTEQ41M_D","A09R_T1_SANTEQ41M_D",null,158,"donnée","dico",null,"E9AREF_COCHE",null,null,"","","","","","","",null,"SANTÉ DE L’ENFANT"]
[null,null,null,"Au moment de ce(s) problème(s) de santé chez votre enfant qu’avez-vous fait ? Vous êtes allé.e à l’hôpital, aux urgences pour votre enfant","T1_SANTEQ41M_E","A09R_T1_SANTEQ41M_E",null,159,"donnée","dico",null,"E9AREF_COCHE",null,null,"","","","","","","",null,"SANTÉ DE L’ENFANT"]
[null,null,null,"Au moment de ce(s) problème(s) de santé chez votre enfant qu’avez-vous fait ? Vous êtes allé.e à la pharmacie","T1_SANTEQ41M_F","A09R_T1_SANTEQ41M_F",null,160,"donnée","dico",null,"E9AREF_COCHE",null,null,"","","","","","","",null,"SANTÉ DE L’ENFANT"]
[null,null,null,"Au moment de ce(s) problème(s) de santé chez votre enfant qu’avez-vous fait ? Vous n’avez rien fait","T1_SANTEQ41M_G","A09R_T1_SANTEQ41M_G",null,161,"donnée","dico",null,"E9AREF_COCHE",null,null,"","","","","","","",null,"SANTÉ DE L’ENFANT"]
[null,null,null,"Au moment de ce(s) problème(s) de santé chez votre enfant qu’avez-vous fait ? Ce n’est pas vous qui vous êtes occupé de l’enfant","T1_SANTEQ41M_H","A09R_T1_SANTEQ41M_H",null,162,"donnée","dico",null,"E9AREF_COCHE",null,null,"","","","","","","",null,"SANTÉ DE L’ENFANT"]
[null,null,null,"Au moment de ce(s) problème(s) de santé chez votre enfant qu’avez-vous fait ? Autre","T1_SANTEQ41M_I","A09R_T1_SANTEQ41M_I",null,163,"donnée","dico",null,"E9AREF_COCHE",null,null,"","","","","","","",null,"SANTÉ DE L’ENFANT"]
[null,null,null,"Avez-vous réussi à joindre ou voir quelqu’un pour votre enfant ?","T1_SANTEQ42","A09R_T1_SANTEQ42",null,164,"donnée","dico",null,"E9AREF_SANTE24F",null,null,"","","","","","","",null,"SANTÉ DE L’ENFANT"]
[null,null,null,"Pour quelle raison n’avez vous rien fait ?","T1_SANTEQ43","A09R_T1_SANTEQ43",null,165,"donnée","dico",null,"E9AREF_SANTE25F",null,null,"","","","","","","",null,"SANTÉ DE L’ENFANT"]
[null,null,null,"Au cours des 15 derniers jours, votre enfant a-t-il eu une ou plusieurs consultations avec un médecin hors de l’hôpital (par téléphone, par vidéo, à domicile, à son cabinet) pour ces autres problèmes de santé ?","T1_SANTEQ44","A09R_T1_SANTEQ44",null,166,"donnée","dico",null,"E9AREF_SANTE10F",null,null,"","","","","","","",null,"SANTÉ DE L’ENFANT"]
[null,null,null,"Au cours des 15 derniers jours, votre enfant a-t-il eu une ou plusieurs consultations avec un médecin de l’hôpital (urgences, consultations dans l’hôpital, consultation à distance avec un médecin de l’hôpital) pour ces autres problèmes de santé ?","T1_SANTEQ45","A09R_T1_SANTEQ45",null,167,"donnée","dico",null,"E9AREF_SANTE10F",null,null,"","","","","","","",null,"SANTÉ DE L’ENFANT"]
[null,null,null,"Au cours des 15 derniers jours, votre enfant a-t-il été au moins une fois hospitalisé pour ces autres problèmes de santé ?","T1_SANTEQ46","A09R_T1_SANTEQ46",null,168,"donnée","dico",null,"E9AREF_SANTE10F",null,null,"","","","","","","",null,"SANTÉ DE L’ENFANT"]
[null,null,null,"Pour quelle(s) raison(s) ?","T1_SANTEQ46P","A09R_T1_SANTEQ46P",null,169,"non-disponible","text",null,"",null,null,"","","","","","","",null,"SANTÉ DE L’ENFANT"]
[null,null,null,"Dans les 15 derniers jours, pour votre enfant, avez-vous appelé le centre 15 ou les pompiers pour ces autres problèmes de santé?","T1_SANTEQ47","A09R_T1_SANTEQ47",null,170,"donnée","dico",null,"E9AREF_YORN",null,null,"","","","","","","",null,"SANTÉ DE L’ENFANT"]
[null,null,null,"Au cours des 15 derniers jours, avez-vous pensé que votre enfant avait peut-être le coronavirus ?","T1_SANTEQ48","A09R_T1_SANTEQ48",null,171,"donnée","dico",null,"E9AREF_YORN",null,null,"","","","","","","",null,"SANTÉ DE L’ENFANT"]
[null,null,null,"Au cours des 15 derniers jours, avez-vous eu peur que votre enfant soit contaminé en allant le faire soigner ?","T1_SANTEQ49","A09R_T1_SANTEQ49",null,172,"donnée","dico",null,"E9AREF_SANTE26F",null,null,"","","","","","","",null,"SANTÉ DE L’ENFANT"]
[null,null,null,"Durant les 15 derniers jours, votre enfant a-t-il pris l’un des médicaments suivants ? Du paracétamol (doliprane, dafalgan, efferalgan)","T1_SANTEQ50M_A","A09R_T1_SANTEQ50M_A",null,173,"donnée","dico",null,"E9AREF_COCHE",null,null,"","","","","","","",null,"SANTÉ DE L’ENFANT"]
[null,null,null,"Durant les 15 derniers jours, votre enfant a-t-il pris l’un des médicaments suivants ? De l’aspirine","T1_SANTEQ50M_B","A09R_T1_SANTEQ50M_B",null,174,"donnée","dico",null,"E9AREF_COCHE",null,null,"","","","","","","",null,"SANTÉ DE L’ENFANT"]
[null,null,null,"Durant les 15 derniers jours, votre enfant a-t-il pris l’un des médicaments suivants ? Un antibiotique","T1_SANTEQ50M_C","A09R_T1_SANTEQ50M_C",null,175,"donnée","dico",null,"E9AREF_COCHE",null,null,"","","","","","","",null,"SANTÉ DE L’ENFANT"]
[null,null,null,"Durant les 15 derniers jours, votre enfant a-t-il pris l’un des médicaments suivants ? Un corticoïde (cortisone, solupred, prednisolone, cortancyl, medrol,…)","T1_SANTEQ50M_D","A09R_T1_SANTEQ50M_D",null,176,"donnée","dico",null,"E9AREF_COCHE",null,null,"","","","","","","",null,"SANTÉ DE L’ENFANT"]
[null,null,null,"Durant les 15 derniers jours, votre enfant a-t-il pris l’un des médicaments suivants ? Un autre anti-inflammatoire (Ibuprofène-advil nurofen, voltarene-diclofenac, ketoprofen biprofenid, celecoxib celebrex,…)","T1_SANTEQ50M_E","A09R_T1_SANTEQ50M_E",null,177,"donnée","dico",null,"E9AREF_COCHE",null,null,"","","","","","","",null,"SANTÉ DE L’ENFANT"]
[null,null,null,"Durant les 15 derniers jours, votre enfant a-t-il pris l’un des médicaments suivants ? Un antipaludéen (chloroquine, nivaquine, hydroxychloroquine plaquenil)","T1_SANTEQ50M_F","A09R_T1_SANTEQ50M_F",null,178,"donnée","dico",null,"E9AREF_COCHE",null,null,"","","","","","","",null,"SANTÉ DE L’ENFANT"]
[null,null,null,"Durant les 15 derniers jours, votre enfant a-t-il pris l’un des médicaments suivants ? Aucun de ces médicaments","T1_SANTEQ50M_G","A09R_T1_SANTEQ50M_G",null,179,"donnée","dico",null,"E9AREF_COCHE",null,null,"","","","","","","",null,"SANTÉ DE L’ENFANT"]
[null,null,null,"Au cours des 15 derniers jours, avez-vous renoncé à des soins pour votre enfant (médecin, kiné, orthophoniste, opération, psychologue, dentiste, etc) ?","T1_SANTEQ51","A09R_T1_SANTEQ51",null,180,"donnée","dico",null,"E9AREF_YORN",null,null,"","","","","","","",null,"SANTÉ DE L’ENFANT"]
[null,null,null,"Pour quelle(s) raison(s) ? Le rendez-vous de mon enfant a été reporté ou annulé","T1_SANTEQ52M_A","A09R_T1_SANTEQ52M_A",null,181,"donnée","dico",null,"E9AREF_COCHE",null,null,"","","","","","","",null,"SANTÉ DE L’ENFANT"]
[null,null,null,"Pour quelle(s) raison(s) ? Le professionnel de santé avait fermé son cabinet","T1_SANTEQ52M_B","A09R_T1_SANTEQ52M_B",null,182,"donnée","dico",null,"E9AREF_COCHE",null,null,"","","","","","","",null,"SANTÉ DE L’ENFANT"]
[null,null,null,"Pour quelle(s) raison(s) ? Ce n’était pas urgent","T1_SANTEQ52M_C","A09R_T1_SANTEQ52M_C",null,183,"donnée","dico",null,"E9AREF_COCHE",null,null,"","","","","","","",null,"SANTÉ DE L’ENFANT"]
[null,null,null,"Pour quelle(s) raison(s) ? Vous ne saviez pas à qui vous adresser","T1_SANTEQ52M_D","A09R_T1_SANTEQ52M_D",null,184,"donnée","dico",null,"E9AREF_COCHE",null,null,"","","","","","","",null,"SANTÉ DE L’ENFANT"]
[null,null,null,"Pour quelle(s) raison(s) ? Vous aviez peur que votre enfant attrape le coronavirus en allant se faire soigner","T1_SANTEQ52M_E","A09R_T1_SANTEQ52M_E",null,185,"donnée","dico",null,"E9AREF_COCHE",null,null,"","","","","","","",null,"SANTÉ DE L’ENFANT"]
[null,null,null,"Pour quelle(s) raison(s) ? Vous n’aviez pas les moyens financiers d’aller le faire soigner","T1_SANTEQ52M_F","A09R_T1_SANTEQ52M_F",null,186,"donnée","dico",null,"E9AREF_COCHE",null,null,"","","","","","","",null,"SANTÉ DE L’ENFANT"]
[null,null,null,"Pour quelle(s) raison(s) ? Il n’y avait pas de médecin ou de professionnel de santé à proximité","T1_SANTEQ52M_G","A09R_T1_SANTEQ52M_G",null,187,"donnée","dico",null,"E9AREF_COCHE",null,null,"","","","","","","",null,"SANTÉ DE L’ENFANT"]
[null,null,null,"Pour quelle(s) raison(s) ? Vous aviez des difficultés à trouver quelqu’un pour vous accompagner","T1_SANTEQ52M_H","A09R_T1_SANTEQ52M_H",null,188,"donnée","dico",null,"E9AREF_COCHE",null,null,"","","","","","","",null,"SANTÉ DE L’ENFANT"]
[null,null,null,"Pour quelle(s) raison(s) ? Autre","T1_SANTEQ52M_I","A09R_T1_SANTEQ52M_I",null,189,"donnée","dico",null,"E9AREF_COCHE",null,null,"","","","","","","",null,"SANTÉ DE L’ENFANT"]
[null,null,null,"Avant le confinement, votre enfant bénéficiait-il de manière régulière d’une prise en charge particulière (kiné, orthophoniste, psychologue, rééducation …)","T1_SANTEQ53","A09R_T1_SANTEQ53",null,190,"donnée","dico",null,"E9AREF_YORN",null,null,"","","","","","","",null,"SANTÉ DE L’ENFANT"]
[null,null,null,"Avez-vous pu poursuivre cette prise en charge depuis le début du confinement ?","T1_SANTEQ54","A09R_T1_SANTEQ54",null,191,"donnée","dico",null,"E9AREF_SANTE29F",null,null,"","","","","","","",null,"SANTÉ DE L’ENFANT"]
[null,null,null,"Assurez-vous vous-même cette prise en charge ?","T1_SANTEQ55","A09R_T1_SANTEQ55",null,192,"donnée","dico",null,"E9AREF_SANTE30F",null,null,"","","","","","","",null,"SANTÉ DE L’ENFANT",null,0]
[null,null,null,"SITUATION PRINCIPALE VIS-À-VIS DU TRAVAIL",null,null,null,null,null,null,null,null,null,null,null,null,null,null,null,null,null,null,null,null,1]
[null,null,null,"Quelle est aujourd'hui votre situation vis-à-vis de l'emploi ? Étudiant.e, lycéen.ne, stagiaire, apprenti.e, etc.","T1_EMPLOIQ01M_A","A09R_T1_EMPLOIQ01M_A",null,193,"donnée","dico",null,"E9AREF_COCHE",null,null,"","","","","","","",null,"SITUATION PRINCIPALE VIS-À-VIS DU TRAVAIL"]
[null,null,null,"Quelle est aujourd'hui votre situation vis-à-vis de l'emploi ? En emploi, y compris en arrêt temporaire de travail (chômage technique ou partiel, arrêt maladie, congé sans solde ou disponibilité, congé maternité, paternité, d'adoption, parental)","T1_EMPLOIQ01M_B","A09R_T1_EMPLOIQ01M_B",null,194,"donnée","dico",null,"E9AREF_COCHE",null,null,"","","","","","","",null,"SITUATION PRINCIPALE VIS-À-VIS DU TRAVAIL"]
[null,null,null,"Quelle est aujourd'hui votre situation vis-à-vis de l'emploi ? Demandeur d'emploi ou à la recherche d'un emploi","T1_EMPLOIQ01M_C","A09R_T1_EMPLOIQ01M_C",null,195,"donnée","dico",null,"E9AREF_COCHE",null,null,"","","","","","","",null,"SITUATION PRINCIPALE VIS-À-VIS DU TRAVAIL"]
[null,null,null,"Quelle est aujourd'hui votre situation vis-à-vis de l'emploi ? Retraité.e ou retiré.e des affaires","T1_EMPLOIQ01M_D","A09R_T1_EMPLOIQ01M_D",null,196,"donnée","dico",null,"E9AREF_COCHE",null,null,"","","","","","","",null,"SITUATION PRINCIPALE VIS-À-VIS DU TRAVAIL"]
[null,null,null,"Quelle est aujourd'hui votre situation vis-à-vis de l'emploi ? Ne travaille pas pour raisons de santé (invalidité, maladie chronique, etc.)","T1_EMPLOIQ01M_E","A09R_T1_EMPLOIQ01M_E",null,197,"donnée","dico",null,"E9AREF_COCHE",null,null,"","","","","","","",null,"SITUATION PRINCIPALE VIS-À-VIS DU TRAVAIL"]
[null,null,null,"Quelle est aujourd'hui votre situation vis-à-vis de l'emploi ? Sans activité professionnelle","T1_EMPLOIQ01M_F","A09R_T1_EMPLOIQ01M_F",null,198,"donnée","dico",null,"E9AREF_COCHE",null,null,"","","","","","","",null,"SITUATION PRINCIPALE VIS-À-VIS DU TRAVAIL"]
[null,null,null,"Quelle est votre profession (ou votre dernière profession) ?","T1_EMPLOIQ01BIS","A09R_T1_EMPLOIQ01BIS",null,199,"donnée","dico",null,"E9AREF_TRAV8F",null,null,"","","","","","","",null,"SITUATION PRINCIPALE VIS-À-VIS DU TRAVAIL"]
[null,null,null,"Dans cet emploi, vous êtes :","T1_EMPLOIQ02","A09R_T1_EMPLOIQ02",null,200,"donnée","dico",null,"E9AREF_TRAV2F",null,null,"","","","","","","",null,"SITUATION PRINCIPALE VIS-À-VIS DU TRAVAIL"]
[null,null,null,"Quel est votre type de contrat de travail ?","T1_EMPLOIQ03","A09R_T1_EMPLOIQ03",null,201,"donnée","dico",null,"E9AREF_TRAV3F",null,null,"","","","","","","",null,"SITUATION PRINCIPALE VIS-À-VIS DU TRAVAIL"]
[null,null,null,"Depuis le début du confinement, êtes-vous passé.e au chômage technique ou partiel ?","T1_EMPLOIQ04","A09R_T1_EMPLOIQ04",null,202,"donnée","dico",null,"E9AREF_TRAV4_YORN1F",null,null,"","","","","","","",null,"SITUATION PRINCIPALE VIS-À-VIS DU TRAVAIL"]
[null,null,null,"Au cours des 7 derniers jours, avez-vous exercé au moins une heure de travail rémunéré ?","T1_EMPLOIQ05","A09R_T1_EMPLOIQ05",null,203,"donnée","dico",null,"E9AREF_YORN",null,null,"","","","","","","",null,"SITUATION PRINCIPALE VIS-À-VIS DU TRAVAIL"]
[null,null,null,"Votre situation professionnelle a-t-elle changé depuis les premières mesures de confinement ?","T1_EMPLOIQ06","A09R_T1_EMPLOIQ06",null,204,"donnée","dico",null,"E9AREF_TRAV5_YORN2F",null,null,"","","","","","","",null,"SITUATION PRINCIPALE VIS-À-VIS DU TRAVAIL"]
[null,null,null,"Votre métier fait-il partie des services considérés comme essentiels dans le contexte de l’épidémie ?","T1_EMPLOIQ07","A09R_T1_EMPLOIQ07",null,205,"donnée","dico",null,"E9AREF_YORN_NSP_F",null,null,"","","","","","","",null,"SITUATION PRINCIPALE VIS-À-VIS DU TRAVAIL"]
[null,null,null,"Vous occupez un poste de :","T1_EMPLOIQ08","A09R_T1_EMPLOIQ08",null,206,"donnée","dico",null,"E9AREF_TRAV6F",null,null,"","","","","","","",null,"SITUATION PRINCIPALE VIS-À-VIS DU TRAVAIL"]
[null,null,null,"Avant les mesures de confinement, aviez-vous un travail rémunéré ?","T1_EMPLOIQ08A","A09R_T1_EMPLOIQ08A",null,207,"donnée","dico",null,"E9AREF_YORN",null,null,"","","","","","","",null,"SITUATION PRINCIPALE VIS-À-VIS DU TRAVAIL"]
[null,null,null,"Depuis le début du confinement, votre situation professionnelle a-t-elle changé ?","T1_EMPLOIQ09","A09R_T1_EMPLOIQ09",null,208,"donnée","dico",null,"E9AREF_TRAV7F",null,null,"","","","","","","",null,"SITUATION PRINCIPALE VIS-À-VIS DU TRAVAIL"]
[null,null,null,"Depuis le début du confinement, votre temps de travail a :","T1_EMPLOIQ10","A09R_T1_EMPLOIQ10",null,209,"donnée","dico",null,"E9AREF_TRAV9F",null,null,"","","","","","","",null,"SITUATION PRINCIPALE VIS-À-VIS DU TRAVAIL"]
[null,null,null,"Quelle est aujourd'hui sa situation vis-à-vis de l'emploi ? Étudiant.e, lycéen.ne, stagiaire, apprenti.e, etc.","T1_EMPLOIQ_C01M_A","A09R_T1_EMPLOIQ_C01M_A",null,210,"donnée","dico",null,"E9AREF_COCHE",null,null,"","","","","","","",null,"SITUATION PRINCIPALE VIS-À-VIS DU TRAVAIL"]
[null,null,null,"Quelle est aujourd'hui sa situation vis-à-vis de l'emploi ? En emploi, y compris en arrêt temporaire de travail (chômage technique ou partiel, arrêt maladie, congé sans solde ou disponibilité, congé maternité, paternité, d'adoption, parental)","T1_EMPLOIQ_C01M_B","A09R_T1_EMPLOIQ_C01M_B",null,211,"donnée","dico",null,"E9AREF_COCHE",null,null,"","","","","","","",null,"SITUATION PRINCIPALE VIS-À-VIS DU TRAVAIL"]
[null,null,null,"Quelle est aujourd'hui sa situation vis-à-vis de l'emploi ? Demandeur d'emploi ou à la recherche d'un emploi","T1_EMPLOIQ_C01M_C","A09R_T1_EMPLOIQ_C01M_C",null,212,"donnée","dico",null,"E9AREF_COCHE",null,null,"","","","","","","",null,"SITUATION PRINCIPALE VIS-À-VIS DU TRAVAIL"]
[null,null,null,"Quelle est aujourd'hui sa situation vis-à-vis de l'emploi ? Retraité.e ou retiré.e des affaires","T1_EMPLOIQ_C01M_D","A09R_T1_EMPLOIQ_C01M_D",null,213,"donnée","dico",null,"E9AREF_COCHE",null,null,"","","","","","","",null,"SITUATION PRINCIPALE VIS-À-VIS DU TRAVAIL"]
[null,null,null,"Quelle est aujourd'hui sa situation vis-à-vis de l'emploi ? Ne travaille pas pour raisons de santé (invalidité, maladie chronique, etc.)","T1_EMPLOIQ_C01M_E","A09R_T1_EMPLOIQ_C01M_E",null,214,"donnée","dico",null,"E9AREF_COCHE",null,null,"","","","","","","",null,"SITUATION PRINCIPALE VIS-À-VIS DU TRAVAIL"]
[null,null,null,"Quelle est aujourd'hui sa situation vis-à-vis de l'emploi ? Sans activité professionnelle","T1_EMPLOIQ_C01M_F","A09R_T1_EMPLOIQ_C01M_F",null,215,"donnée","dico",null,"E9AREF_COCHE",null,null,"","","","","","","",null,"SITUATION PRINCIPALE VIS-À-VIS DU TRAVAIL"]
[null,null,null,"Quelle est sa profession (ou sa dernière profession) ?","T1_EMPLOIQ_C01BIS","A09R_T1_EMPLOIQ_C01BIS",null,216,"donnée","dico",null,"E9AREF_TRAV8F",null,null,"","","","","","","",null,"SITUATION PRINCIPALE VIS-À-VIS DU TRAVAIL"]
[null,null,null,"Dans cet emploi, est-il/elle :","T1_EMPLOIQ_C02","A09R_T1_EMPLOIQ_C02",null,217,"donnée","dico",null,"E9AREF_TRAV2ALTER",null,null,"","","","","","","",null,"SITUATION PRINCIPALE VIS-À-VIS DU TRAVAIL"]
[null,null,null,"Quel est son type de contrat de travail ?","T1_EMPLOIQ_C03","A09R_T1_EMPLOIQ_C03",null,218,"donnée","dico",null,"E9AREF_TRAV3F",null,null,"","","","","","","",null,"SITUATION PRINCIPALE VIS-À-VIS DU TRAVAIL"]
[null,null,null,"Depuis le début du confinement, est-il/elle passé.e au chômage technique ou partiel ?","T1_EMPLOIQ_C04","A09R_T1_EMPLOIQ_C04",null,219,"donnée","dico",null,"E9AREF_TRAV4_YORN1F",null,null,"","","","","","","",null,"SITUATION PRINCIPALE VIS-À-VIS DU TRAVAIL"]
[null,null,null,"Au cours des 7 derniers jours, a-t-il/elle exercé au moins une heure de travail rémunéré ?","T1_EMPLOIQ_C05","A09R_T1_EMPLOIQ_C05",null,220,"donnée","dico",null,"E9AREF_YORN",null,null,"","","","","","","",null,"SITUATION PRINCIPALE VIS-À-VIS DU TRAVAIL"]
[null,null,null,"Sa situation professionnelle a-t-elle changé depuis les premières mesures de confinement ?","T1_EMPLOIQ_C06","A09R_T1_EMPLOIQ_C06",null,221,"donnée","dico",null,"E9AREF_TRAV5_YORN2ALTER",null,null,"","","","","","","",null,"SITUATION PRINCIPALE VIS-À-VIS DU TRAVAIL"]
[null,null,null,"Son métier fait-il partie des services considérés comme essentiels dans le contexte de l’épidémie ?","T1_EMPLOIQ_C07","A09R_T1_EMPLOIQ_C07",null,222,"donnée","dico",null,"E9AREF_YORN_NSP_F",null,null,"","","","","","","",null,"SITUATION PRINCIPALE VIS-À-VIS DU TRAVAIL"]
[null,null,null,"Il/elle occupe un poste de :","T1_EMPLOIQ_C08","A09R_T1_EMPLOIQ_C08",null,223,"donnée","dico",null,"E9AREF_TRAV6F",null,null,"","","","","","","",null,"SITUATION PRINCIPALE VIS-À-VIS DU TRAVAIL"]
[null,null,null,"Avant les mesures de confinement, avait-il/elle un travail rémunéré ?","T1_EMPLOIQ_C08A","A09R_T1_EMPLOIQ_C08A",null,224,"donnée","dico",null,"E9AREF_YORN",null,null,"","","","","","","",null,"SITUATION PRINCIPALE VIS-À-VIS DU TRAVAIL"]
[null,null,null,"Depuis le début du confinement, sa situation professionnelle a-t-elle changé ?","T1_EMPLOIQ_C09","A09R_T1_EMPLOIQ_C09",null,225,"donnée","dico",null,"E9AREF_TRAV7ALTER",null,null,"","","","","","","",null,"SITUATION PRINCIPALE VIS-À-VIS DU TRAVAIL"]
[null,null,null,"Depuis le début du confinement, son temps de travail a :","T1_EMPLOIQ_C10","A09R_T1_EMPLOIQ_C10",null,226,"donnée","dico",null,"E9AREF_TRAV9F",null,null,"","","","","","","",null,"SITUATION PRINCIPALE VIS-À-VIS DU TRAVAIL"]
[null,null,null,"Depuis le début du confinement, la situation financière de votre foyer a-t-elle changé ?","T1_EMPLOIQ11","A09R_T1_EMPLOIQ11",null,227,"donnée","dico",null,"E9AREF_TRAV10F",null,null,"","","","","","","",null,"SITUATION PRINCIPALE VIS-À-VIS DU TRAVAIL"]
[null,null,null,"Aujourd’hui, que diriez-vous de la situation financière de votre foyer ?","T1_EMPLOIQ12","A09R_T1_EMPLOIQ12",null,228,"donnée","dico",null,"E9AREF_TRAV11F",null,null,"","","","","","","",null,"SITUATION PRINCIPALE VIS-À-VIS DU TRAVAIL",null,0]
[null,null,null,"RELATIONS FAMILIALES",null,null,null,null,null,null,null,null,null,null,null,null,null,null,null,null,null,null,null,null,1]
[null,null,null,"En matière de tâches domestiques et de prise en charge des enfants, lorsque vous comparez la période de confinement à la période antérieure, comment a évolué le partage des tâches entre vous et votre conjoint.e. ?","T1_FAMILLEQ01","A09R_T1_FAMILLEQ01",null,229,"donnée","dico",null,"E9AREF_FAMILLE1F",null,null,"","","","","","","",null,"RELATIONS FAMILIALES"]
[null,null,null,"Actuellement dans votre foyer qui prend en charge les tâches domestiques courantes ?","T1_FAMILLEQ02","A09R_T1_FAMILLEQ02",null,230,"donnée","dico",null,"E9AREF_FAMILLE2F",null,null,"","","","","","","",null,"RELATIONS FAMILIALES"]
[null,null,null,"Actuellement dans votre foyer qui prend en charge les activités consacrées à votre ou vos enfants (repas, loisirs, éducation)  ?","T1_FAMILLEQ03","A09R_T1_FAMILLEQ03",null,231,"donnée","dico",null,"E9AREF_FAMILLE2F",null,null,"","","","","","","",null,"RELATIONS FAMILIALES"]
[null,null,null,"Diriez-vous que vos relations avec votre ou vos enfants sont aujourd’hui :","T1_FAMILLEQ04","A09R_T1_FAMILLEQ04",null,232,"donnée","dico",null,"E9AREF_FAMILLE3F",null,null,"","","","","","","",null,"RELATIONS FAMILIALES"]
[null,null,null,"Diriez-vous que les relations entre vos enfants sont :","T1_FAMILLEQ05","A09R_T1_FAMILLEQ05",null,233,"donnée","dico",null,"E9AREF_FAMILLE4F",null,null,"","","","","","","",null,"RELATIONS FAMILIALES"]
[null,null,null,"L’enfant a-t-il eu des contacts (de visu, téléphonique ou visio) avec son autre parent depuis le confinement ?","T1_FAMILLEQ06","A09R_T1_FAMILLEQ06",null,234,"donnée","dico",null,"E9AREF_FAMILLE5F",null,null,"","","","","","","",null,"RELATIONS FAMILIALES",null,0]
[null,null,null,"LOISIRS DE L’ENFANT",null,null,null,null,null,null,null,null,null,null,null,null,null,null,null,null,null,null,null,null,1]
[null,null,null,"Dans les 7 derniers jours, en moyenne, combien de temps par jour votre enfant a-t-il consacré à la lecture, une activité artistique ou jeux de société (non connectés)(Nombre d'heures)","T1_LOISIRQ01H","A09R_T1_LOISIRQ01H",null,235,"donnée","dico",null,"",null,null,"","","","","","","",null,"LOISIRS DE L’ENFANT"]
[null,null,null,"Dans les 7 derniers jours, en moyenne, combien de temps par jour votre enfant a-t-il consacré à la lecture, une activité artistique ou jeux de société (non connectés) (Nombre de minutes)","T1_LOISIRQ01M","A09R_T1_LOISIRQ01M",null,236,"donnée","dico",null,"",null,null,"","","","","","","",null,"LOISIRS DE L’ENFANT"]
[null,null,null,"Pour la lecture, activité artistique ou jeux de société (non connectés), votre enfant l’a-t-il fait avec vous :","T1_LOISIRQ_R01","A09R_T1_LOISIRQ_R01",null,237,"donnée","dico",null,"E9AREF_LOISIRS1F",null,null,"","","","","","","",null,"LOISIRS DE L’ENFANT"]
[null,null,null,"Pour la lecture, activité artistique ou jeux de société (non connectés), votre enfant l’a-t-il fait avec votre conjoint :","T1_LOISIRQ_C01","A09R_T1_LOISIRQ_C01",null,238,"donnée","dico",null,"E9AREF_LOISIRS1F",null,null,"","","","","","","",null,"LOISIRS DE L’ENFANT"]
[null,null,null,"Dans les 7 derniers jours, en moyenne, combien de temps par jour votre enfant a-t-il consacré à des jeux sur console ou en ligne (Nombre d'heures)","T1_LOISIRQ02H","A09R_T1_LOISIRQ02H",null,239,"donnée","dico",null,"",null,null,"","","","","","","",null,"LOISIRS DE L’ENFANT"]
[null,null,null,"Dans les 7 derniers jours, en moyenne, combien de temps par jour votre enfant a-t-il consacré à des jeux sur console ou en ligne (Nombre de minutes)","T1_LOISIRQ02M","A09R_T1_LOISIRQ02M",null,240,"donnée","dico",null,"",null,null,"","","","","","","",null,"LOISIRS DE L’ENFANT"]
[null,null,null,"Dans les 7 derniers jours, en moyenne, combien de temps par jour votre enfant a-t-il consacré aux réseaux sociaux (facebook, instagram, snapchat, etc.) (Nombre d'heures)","T1_LOISIRQ03H","A09R_T1_LOISIRQ03H",null,241,"donnée","dico",null,"",null,null,"","","","","","","",null,"LOISIRS DE L’ENFANT"]
[null,null,null,"Dans les 7 derniers jours, en moyenne, combien de temps par jour votre enfant a-t-il consacré aux réseaux sociaux (facebook, instagram, snapchat, etc.) (Nombre de minutes)","T1_LOISIRQ03M","A09R_T1_LOISIRQ03M",null,242,"donnée","dico",null,"",null,null,"","","","","","","",null,"LOISIRS DE L’ENFANT"]
[null,null,null,"Dans les 7 derniers jours, en moyenne, combien de temps par jour votre enfant a-t-il consacré à la télévision ou d’autres écrans pour suivre des programmes scolaires ou éducatifs (Nombre d'heures)","T1_LOISIRQ04H","A09R_T1_LOISIRQ04H",null,243,"donnée","dico",null,"",null,null,"","","","","","","",null,"LOISIRS DE L’ENFANT"]
[null,null,null,"Dans les 7 derniers jours, en moyenne, combien de temps par jour votre enfant a-t-il consacré à la télévision ou d’autres écrans pour suivre des programmes scolaires ou éducatifs (Nombre de minutes)","T1_LOISIRQ04M","A09R_T1_LOISIRQ04M",null,244,"donnée","dico",null,"",null,null,"","","","","","","",null,"LOISIRS DE L’ENFANT"]
[null,null,null,"Dans les 7 derniers jours, en moyenne, combien de temps par jour votre enfant a-t-il consacré à la télévision ou d’autres écrans pour d’autres programmes (Nombre d'heures)","T1_LOISIRQ05H","A09R_T1_LOISIRQ05H",null,245,"donnée","dico",null,"",null,null,"","","","","","","",null,"LOISIRS DE L’ENFANT"]
[null,null,null,"Dans les 7 derniers jours, en moyenne, combien de temps par jour votre enfant a-t-il consacré à la télévision ou d’autres écrans pour d’autres programmes (Nombre de minutes)","T1_LOISIRQ05M","A09R_T1_LOISIRQ05M",null,246,"donnée","dico",null,"",null,null,"","","","","","","",null,"LOISIRS DE L’ENFANT"]
[null,null,null,"Pour la télévision, jeux sur console ou en ligne, autres écrans pour le loisir, votre enfant l’a-t-il fait avec vous :","T1_LOISIRQ_R03","A09R_T1_LOISIRQ_R03",null,247,"donnée","dico",null,"E9AREF_LOISIRS1F",null,null,"","","","","","","",null,"LOISIRS DE L’ENFANT"]
[null,null,null,"Pour la télévision, jeux sur console ou en ligne, autres écrans pour le loisir, votre enfant l’a-t-il fait avec votre conjoint :","T1_LOISIRQ_C03","A09R_T1_LOISIRQ_C03",null,248,"donnée","dico",null,"E9AREF_LOISIRS1F",null,null,"","","","","","","",null,"LOISIRS DE L’ENFANT"]
[null,null,null,"Dans les 7 derniers jours, en moyenne, combien de temps par jour votre enfant a-t-il consacré au sport ou à la promenade hors du domicile (Nombre d'heures)","T1_LOISIRQ06H","A09R_T1_LOISIRQ06H",null,249,"donnée","dico",null,"",null,null,"","","","","","","",null,"LOISIRS DE L’ENFANT"]
[null,null,null,"Dans les 7 derniers jours, en moyenne, combien de temps par jour votre enfant a-t-il consacré au sport ou à la promenade hors du domicile (Nombre de minutes)","T1_LOISIRQ06M","A09R_T1_LOISIRQ06M",null,250,"donnée","dico",null,"",null,null,"","","","","","","",null,"LOISIRS DE L’ENFANT"]
[null,null,null,"Pour le sport ou à la promenade hors du domicile, votre enfant l’a-t-il fait avec vous :","T1_LOISIRQ_R06","A09R_T1_LOISIRQ_R06",null,251,"donnée","dico",null,"E9AREF_LOISIRS1F",null,null,"","","","","","","",null,"LOISIRS DE L’ENFANT"]
[null,null,null,"Pour le sport ou à la promenade hors du domicile, votre enfant l’a-t-il fait avec votre conjoint :","T1_LOISIRQ_C06","A09R_T1_LOISIRQ_C06",null,252,"donnée","dico",null,"E9AREF_LOISIRS1F",null,null,"","","","","","","",null,"LOISIRS DE L’ENFANT"]
[null,null,null,"Dans les 7 derniers jours, en moyenne, combien de temps par jour votre enfant a-t-il consacré à des activités physiques dans le domicile (Nombre d'heures)","T1_LOISIRQ07H","A09R_T1_LOISIRQ07H",null,253,"donnée","dico",null,"",null,null,"","","","","","","",null,"LOISIRS DE L’ENFANT"]
[null,null,null,"Dans les 7 derniers jours, en moyenne, combien de temps par jour votre enfant a-t-il consacré à des activités physiques dans le domicile (Nombre de minutes)","T1_LOISIRQ07M","A09R_T1_LOISIRQ07M",null,254,"donnée","dico",null,"",null,null,"","","","","","","",null,"LOISIRS DE L’ENFANT"]
[null,null,null,"Pour les activités physiques dans le domicile , votre enfant l’a-t-il fait avec vous :","T1_LOISIRQ_R07","A09R_T1_LOISIRQ_R07",null,255,"donnée","dico",null,"E9AREF_LOISIRS1F",null,null,"","","","","","","",null,"LOISIRS DE L’ENFANT"]
[null,null,null,"Pour les activités physiques dans le domicile , votre enfant l’a-t-il fait avec votre conjoint :","T1_LOISIRQ_C07","A09R_T1_LOISIRQ_C07",null,256,"donnée","dico",null,"E9AREF_LOISIRS1F",null,null,"","","","","","","",null,"LOISIRS DE L’ENFANT"]
[null,null,null,"Dans les 7 derniers jours, en moyenne, combien de temps par jour votre enfant a-t-il consacré à des activités physiques dans la cour ou le jardin du domicile (Nombre d'heures)","T1_LOISIRQ08H","A09R_T1_LOISIRQ08H",null,257,"donnée","dico",null,"",null,null,"","","","","","","",null,"LOISIRS DE L’ENFANT"]
[null,null,null,"Dans les 7 derniers jours, en moyenne, combien de temps par jour votre enfant a-t-il consacré à des activités physiques dans la cour ou le jardin du domicile(Nombre de minutes)","T1_LOISIRQ08M","A09R_T1_LOISIRQ08M",null,258,"donnée","dico",null,"",null,null,"","","","","","","",null,"LOISIRS DE L’ENFANT"]
[null,null,null,"Pour les activités physiques dans la cour ou le jardin du domicile , votre enfant l’a-t-il fait avec vous :","T1_LOISIRQ_R08","A09R_T1_LOISIRQ_R08",null,259,"donnée","dico",null,"E9AREF_LOISIRS1F",null,null,"","","","","","","",null,"LOISIRS DE L’ENFANT"]
[null,null,null,"Pour les activités physiques dans la cour ou le jardin du domicile , votre enfant l’a-t-il fait avec votre conjoint :","T1_LOISIRQ_C08","A09R_T1_LOISIRQ_C08",null,260,"donnée","dico",null,"E9AREF_LOISIRS1F",null,null,"","","","","","","",null,"LOISIRS DE L’ENFANT"]
[null,null,null,"Pour la lecture, le dessin, les jeux de société (non connectés), indiquez s’il/elle y a consacré plus ou moins de temps qu’avant le confinement?","T1_LOISIRQ9","A09R_T1_LOISIRQ9",null,261,"donnée","dico",null,"E9AREF_LOISIRS2F",null,null,"","","","","","","",null,"LOISIRS DE L’ENFANT"]
[null,null,null,"Pour les jeux sur console ou en ligne, indiquez s’il/elle y a consacré plus ou moins de temps qu’avant le confinement?","T1_LOISIRQ10","A09R_T1_LOISIRQ10",null,262,"donnée","dico",null,"E9AREF_LOISIRS2F",null,null,"","","","","","","",null,"LOISIRS DE L’ENFANT"]
[null,null,null,"Pour les réseaux sociaux (facebook, instagram, snapchat, etc.), indiquez s’il/elle y a consacré plus ou moins de temps qu’avant le confinement?","T1_LOISIRQ11","A09R_T1_LOISIRQ11",null,263,"donnée","dico",null,"E9AREF_LOISIRS2F",null,null,"","","","","","","",null,"LOISIRS DE L’ENFANT"]
[null,null,null,"Pour la télévision ou d’autres écrans pour suivre des programmes scolaires ou éducatifs, indiquez s’il/elle y a consacré plus ou moins de temps qu’avant le confinement?","T1_LOISIRQ12","A09R_T1_LOISIRQ12",null,264,"donnée","dico",null,"E9AREF_LOISIRS2F",null,null,"","","","","","","",null,"LOISIRS DE L’ENFANT"]
[null,null,null,"Pour la télévision ou d'autres écrans pour le loisir, indiquez s’il/elle y a consacré plus ou moins de temps qu’avant le confinement?","T1_LOISIRQ13","A09R_T1_LOISIRQ13",null,265,"donnée","dico",null,"E9AREF_LOISIRS2F",null,null,"","","","","","","",null,"LOISIRS DE L’ENFANT"]
[null,null,null,"Pour le sport ou promenade hors du domicile, indiquez s’il/elle y a consacré plus ou moins de temps qu’avant le confinement?","T1_LOISIRQ14","A09R_T1_LOISIRQ14",null,266,"donnée","dico",null,"E9AREF_LOISIRS2F",null,null,"","","","","","","",null,"LOISIRS DE L’ENFANT"]
[null,null,null,"Pour les activités physiques dans le domicile, indiquez s’il/elle y a consacré plus ou moins de temps qu’avant le confinement?","T1_LOISIRQ15","A09R_T1_LOISIRQ15",null,267,"donnée","dico",null,"E9AREF_LOISIRS2F",null,null,"","","","","","","",null,"LOISIRS DE L’ENFANT"]
[null,null,null,"Pour les activités physiques dans la cour ou le jardin du domicile, indiquez s’il/elle y a consacré plus ou moins de temps qu’avant le confinement?","T1_LOISIRQ16","A09R_T1_LOISIRQ16",null,268,"donnée","dico",null,"E9AREF_LOISIRS2F",null,null,"","","","","","","",null,"LOISIRS DE L’ENFANT"]
[null,null,null,"Actuellement, diriez-vous que votre enfant participe aux tâches domestiques courantes (cuisine, courses, ménage, linge) :","T1_LOISIRQ17","A09R_T1_LOISIRQ17",null,269,"donnée","dico",null,"E9AREF_LOISIRS3F",null,null,"","","","","","","",null,"LOISIRS DE L’ENFANT",null,0]
[null,null,null,"COMPORTEMENT ET SOMMEIL DE L’ENFANT",null,null,null,null,null,null,null,null,null,null,null,null,null,null,null,null,null,null,null,null,1]
[null,null,null,"Au cours des 15 derniers jours, votre enfant s’est-il plaint souvent de maux de tête ou de ventre ou de nausées ?","T1_COMPORTQ01","A09R_T1_COMPORTQ01",null,270,"donnée","dico",null,"E9AREF_COMPORT1F",null,null,"","","","","","","",null,"COMPORTEMENT ET SOMMEIL DE L’ENFANT"]
[null,null,null,"Au cours des 15 derniers jours, votre enfant a-t-il été agité, hyperactif, ne tenait pas en place ?","T1_COMPORTQ02","A09R_T1_COMPORTQ02",null,271,"donnée","dico",null,"E9AREF_COMPORT1F",null,null,"","","","","","","",null,"COMPORTEMENT ET SOMMEIL DE L’ENFANT"]
[null,null,null,"Au cours des 15 derniers jours, votre enfant s’est-il inquiété souvent, a paru souvent soucieux ?","T1_COMPORTQ03","A09R_T1_COMPORTQ03",null,272,"donnée","dico",null,"E9AREF_COMPORT1F",null,null,"","","","","","","",null,"COMPORTEMENT ET SOMMEIL DE L’ENFANT"]
[null,null,null,"Au cours des 15 derniers jours, votre enfant n’a pas tenu en place ou s’est tortillé constamment ?","T1_COMPORTQ04","A09R_T1_COMPORTQ04",null,273,"donnée","dico",null,"E9AREF_COMPORT1F",null,null,"","","","","","","",null,"COMPORTEMENT ET SOMMEIL DE L’ENFANT"]
[null,null,null,"Au cours des 15 derniers jours, votre enfant a-t-il été souvent malheureux, abattu, ou a-t-il pleuré souvent ?","T1_COMPORTQ05","A09R_T1_COMPORTQ05",null,274,"donnée","dico",null,"E9AREF_COMPORT1F",null,null,"","","","","","","",null,"COMPORTEMENT ET SOMMEIL DE L’ENFANT"]
[null,null,null,"Au cours des 15 derniers jours, votre enfant a-t-il été facilement distrait, ou a-t-il eu du mal à se concentrer ?","T1_COMPORTQ06","A09R_T1_COMPORTQ06",null,275,"donnée","dico",null,"E9AREF_COMPORT1F",null,null,"","","","","","","",null,"COMPORTEMENT ET SOMMEIL DE L’ENFANT"]
[null,null,null,"Au cours des 15 derniers jours, votre enfant a-t-il été anxieux, ou s’est-il cramponné aux adultes dans les situations nouvelles, a-t-il perdu facilement ses moyens ?","T1_COMPORTQ07","A09R_T1_COMPORTQ07",null,276,"donnée","dico",null,"E9AREF_COMPORT1F",null,null,"","","","","","","",null,"COMPORTEMENT ET SOMMEIL DE L’ENFANT"]
[null,null,null,"Au cours des 15 derniers jours, votre enfant a-t-il réfléchi avant d’agir ?","T1_COMPORTQ08","A09R_T1_COMPORTQ08",null,277,"donnée","dico",null,"E9AREF_COMPORT1F",null,null,"","","","","","","",null,"COMPORTEMENT ET SOMMEIL DE L’ENFANT"]
[null,null,null,"Au cours des 15 derniers jours, votre enfant a-t-il eu de nombreuses peurs, a-t-il été facilement effrayé ?","T1_COMPORTQ09","A09R_T1_COMPORTQ09",null,278,"donnée","dico",null,"E9AREF_COMPORT1F",null,null,"","","","","","","",null,"COMPORTEMENT ET SOMMEIL DE L’ENFANT"]
[null,null,null,"Au cours des 15 derniers jours, votre enfant a-t-il été au bout des tâches ou devoirs, et maintenait-il bien son attention ?","T1_COMPORTQ10","A09R_T1_COMPORTQ10",null,279,"donnée","dico",null,"E9AREF_COMPORT1F",null,null,"","","","","","","",null,"COMPORTEMENT ET SOMMEIL DE L’ENFANT"]
[null,null,null,"Diriez vous que, dans les 15 derniers jours, les troubles du comportement que présente votre enfant ?","T1_COMPORTQ11","A09R_T1_COMPORTQ11",null,280,"donnée","dico",null,"E9AREF_COMPORT2F",null,null,"","","","","","","",null,"COMPORTEMENT ET SOMMEIL DE L’ENFANT"]
[null,null,null,"Diriez-vous que son temps de sommeil a changé depuis le début du confinement ?","T1_COMPORTQ12","A09R_T1_COMPORTQ12",null,281,"donnée","dico",null,"E9AREF_COMPORT3F",null,null,"","","","","","","",null,"COMPORTEMENT ET SOMMEIL DE L’ENFANT"]
[null,null,null,"Diriez-vous que depuis le début du confinement, votre enfant a des difficultés pour dormir (comme des difficultés d’endormissement, des réveils nocturnes fréquents ou trop tôt sans possibilité de rendormissement) :","T1_COMPORTQ13","A09R_T1_COMPORTQ13",null,282,"donnée","dico",null,"E9AREF_COMPORT4F",null,null,"","","","","","","",null,"COMPORTEMENT ET SOMMEIL DE L’ENFANT",null,0]
[null,null,null,"TRAVAIL SCOLAIRE PENDANT LE CONFINEMENT",null,null,null,null,null,null,null,null,null,null,null,null,null,null,null,null,null,null,null,null,1]
[null,null,null,"Avant le confinement, votre enfant était :","T1_SCOLQ01","A09R_T1_SCOLQ01",null,283,"donnée","dico",null,"E9AREF_SCOLAR1F",null,null,"","","","","","","",null,"TRAVAIL SCOLAIRE PENDANT LE CONFINEMENT"]
[null,null,null,"En quelle classe est votre enfant ?","T1_SCOLQ02","A09R_T1_SCOLQ02",null,284,"donnée","dico",null,"E9AREF_SCOLAR2F",null,null,"","","","","","","",null,"TRAVAIL SCOLAIRE PENDANT LE CONFINEMENT"]
[null,null,null,"Votre enfant est-il actuellement en vacances scolaires ?","T1_SCOLQ03","A09R_T1_SCOLQ03",null,285,"donnée","dico",null,"E9AREF_YORN",null,null,"","","","","","","",null,"TRAVAIL SCOLAIRE PENDANT LE CONFINEMENT"]
[null,null,null,"Au cours de cette période, votre enfant a-t-il été accueilli dans une école ?","T1_SCOLQ04","A09R_T1_SCOLQ04",null,286,"donnée","dico",null,"E9AREF_YORN",null,null,"","","","","","","",null,"TRAVAIL SCOLAIRE PENDANT LE CONFINEMENT"]
[null,null,null,"Est-ce que c’était dans son école habituelle ?","T1_SCOLQ05","A09R_T1_SCOLQ05",null,287,"donnée","dico",null,"E9AREF_YORN",null,null,"","","","","","","",null,"TRAVAIL SCOLAIRE PENDANT LE CONFINEMENT"]
[null,null,null,"Est-ce que c’était pour la totalité des heures de classe ?","T1_SCOLQ06","A09R_T1_SCOLQ06",null,288,"donnée","dico",null,"E9AREF_YORN",null,null,"","","","","","","",null,"TRAVAIL SCOLAIRE PENDANT LE CONFINEMENT"]
[null,null,null,"Est-ce que votre enfant a pu travailler autant qu’il travaillait dans sa classe avant le confinement ?","T1_SCOLQ07","A09R_T1_SCOLQ07",null,289,"donnée","dico",null,"E9AREF_SCOLAR3F",null,null,"","","","","","","",null,"TRAVAIL SCOLAIRE PENDANT LE CONFINEMENT"]
[null,null,null,"Diriez-vous que cet accueil à l’école pendant le confinement s’est passé de façon :","T1_SCOLQ08","A09R_T1_SCOLQ08",null,290,"donnée","dico",null,"E9AREF_SCOLAR4F",null,null,"","","","","","","",null,"TRAVAIL SCOLAIRE PENDANT LE CONFINEMENT"]
[null,null,null,"Un.e enseignant.e a-t-il/elle transmis du travail scolaire pour votre enfant ?","T1_SCOLQ09","A09R_T1_SCOLQ09",null,291,"donnée","dico",null,"E9AREF_YORN_NSP_F",null,null,"","","","","","","",null,"TRAVAIL SCOLAIRE PENDANT LE CONFINEMENT"]
[null,null,null,"Comment vous a-t-il/elle fait parvenir ce travail scolaire ? Par e-mail","T1_SCOLQ10M_A","A09R_T1_SCOLQ10M_A",null,292,"donnée","dico",null,"E9AREF_COCHE",null,null,"","","","","","","",null,"TRAVAIL SCOLAIRE PENDANT LE CONFINEMENT"]
[null,null,null,"Comment vous a-t-il/elle fait parvenir ce travail scolaire ? Par les outils numériques de l’école comme un ENT (espace numérique de travail)","T1_SCOLQ10M_B","A09R_T1_SCOLQ10M_B",null,293,"donnée","dico",null,"E9AREF_COCHE",null,null,"","","","","","","",null,"TRAVAIL SCOLAIRE PENDANT LE CONFINEMENT"]
[null,null,null,"Comment vous a-t-il/elle fait parvenir ce travail scolaire ? Par d’autres moyens informatiques","T1_SCOLQ10M_C","A09R_T1_SCOLQ10M_C",null,294,"donnée","dico",null,"E9AREF_COCHE",null,null,"","","","","","","",null,"TRAVAIL SCOLAIRE PENDANT LE CONFINEMENT"]
[null,null,null,"Comment vous a-t-il/elle fait parvenir ce travail scolaire ? Autre","T1_SCOLQ10M_D","A09R_T1_SCOLQ10M_D",null,295,"donnée","dico",null,"E9AREF_COCHE",null,null,"","","","","","","",null,"TRAVAIL SCOLAIRE PENDANT LE CONFINEMENT"]
[null,null,null,"Avez-vous rencontré des difficultés pour recevoir le travail demandé par les enseignants ?","T1_SCOLQ11","A09R_T1_SCOLQ11",null,296,"donnée","dico",null,"E9AREF_SCOLAR6F",null,null,"","","","","","","",null,"TRAVAIL SCOLAIRE PENDANT LE CONFINEMENT"]
[null,null,null,"Au cours de cette période, combien de temps votre enfant a-t-il consacré au travail scolaire en moyenne par jour ?","T1_SCOLQ12","A09R_T1_SCOLQ12",null,297,"donnée","dico",null,"E9AREF_SCOLAR7F",null,null,"","","","","","","",null,"TRAVAIL SCOLAIRE PENDANT LE CONFINEMENT"]
[null,null,null,"Toujours au cours de cette période, est-ce que votre enfant a pu s’isoler pour travailler ?","T1_SCOLQ13","A09R_T1_SCOLQ13",null,298,"donnée","dico",null,"E9AREF_SCOLAR8F",null,null,"","","","","","","",null,"TRAVAIL SCOLAIRE PENDANT LE CONFINEMENT"]
[null,null,null,"Durant cette période, quelqu’un a-t-il pu aider votre enfant pour le travail scolaire ?","T1_SCOLQ14","A09R_T1_SCOLQ14",null,299,"donnée","dico",null,"E9AREF_YORN",null,null,"","","","","","","",null,"TRAVAIL SCOLAIRE PENDANT LE CONFINEMENT"]
[null,null,null,"Qui ? Vous","T1_SCOLQ15M_A","A09R_T1_SCOLQ15M_A",null,300,"donnée","dico",null,"E9AREF_COCHE",null,null,"","","","","","","",null,"TRAVAIL SCOLAIRE PENDANT LE CONFINEMENT"]
[null,null,null,"Qui ? L’autre parent","T1_SCOLQ15M_B","A09R_T1_SCOLQ15M_B",null,301,"donnée","dico",null,"E9AREF_COCHE",null,null,"","","","","","","",null,"TRAVAIL SCOLAIRE PENDANT LE CONFINEMENT"]
[null,null,null,"Qui ? Votre conjoint.e (qui n’est pas le parent de l’enfant)","T1_SCOLQ15M_C","A09R_T1_SCOLQ15M_C",null,302,"donnée","dico",null,"E9AREF_COCHE",null,null,"","","","","","","",null,"TRAVAIL SCOLAIRE PENDANT LE CONFINEMENT"]
[null,null,null,"Qui ? Un frère ou une sœur","T1_SCOLQ15M_D","A09R_T1_SCOLQ15M_D",null,303,"donnée","dico",null,"E9AREF_COCHE",null,null,"","","","","","","",null,"TRAVAIL SCOLAIRE PENDANT LE CONFINEMENT"]
[null,null,null,"Qui ? Un grand-parent","T1_SCOLQ15M_E","A09R_T1_SCOLQ15M_E",null,304,"donnée","dico",null,"E9AREF_COCHE",null,null,"","","","","","","",null,"TRAVAIL SCOLAIRE PENDANT LE CONFINEMENT"]
[null,null,null,"Qui ? Une autre personne bénévole","T1_SCOLQ15M_F","A09R_T1_SCOLQ15M_F",null,305,"donnée","dico",null,"E9AREF_COCHE",null,null,"","","","","","","",null,"TRAVAIL SCOLAIRE PENDANT LE CONFINEMENT"]
[null,null,null,"Qui ? Une autre personne rémunérée","T1_SCOLQ15M_G","A09R_T1_SCOLQ15M_G",null,306,"donnée","dico",null,"E9AREF_COCHE",null,null,"","","","","","","",null,"TRAVAIL SCOLAIRE PENDANT LE CONFINEMENT"]
[null,null,null,"Au cours de cette période, combien de temps votre enfant a-t-il été aidé pour son travail scolaire en moyenne par jour ?","T1_SCOLQ16","A09R_T1_SCOLQ16",null,307,"donnée","dico",null,"E9AREF_SCOLAR10F",null,null,"","","","","","","",null,"TRAVAIL SCOLAIRE PENDANT LE CONFINEMENT"]
[null,null,null,"La ou les personnes qui ont aidé votre enfant ont-elles éprouvé des difficultés pour l’aider à faire son travail scolaire ?","T1_SCOLQ17","A09R_T1_SCOLQ17",null,308,"donnée","dico",null,"E9AREF_YORN_NSP_F",null,null,"","","","","","","",null,"TRAVAIL SCOLAIRE PENDANT LE CONFINEMENT"]
[null,null,null,"Quelles ont été ces difficultés ? Que l’enfant accepte de faire le travail","T1_SCOLQ18M_A","A09R_T1_SCOLQ18M_A",null,309,"donnée","dico",null,"E9AREF_COCHE",null,null,"","","","","","","",null,"TRAVAIL SCOLAIRE PENDANT LE CONFINEMENT"]
[null,null,null,"Quelles ont été ces difficultés ? Que l’enfant comprenne le travail","T1_SCOLQ18M_B","A09R_T1_SCOLQ18M_B",null,310,"donnée","dico",null,"E9AREF_COCHE",null,null,"","","","","","","",null,"TRAVAIL SCOLAIRE PENDANT LE CONFINEMENT"]
[null,null,null,"Quelles ont été ces difficultés ? Que la personne qui aide comprenne ce qui est demandé","T1_SCOLQ18M_C","A09R_T1_SCOLQ18M_C",null,311,"donnée","dico",null,"E9AREF_COCHE",null,null,"","","","","","","",null,"TRAVAIL SCOLAIRE PENDANT LE CONFINEMENT"]
[null,null,null,"Quelles ont été ces difficultés ? Que la personne qui aide trouve assez de temps","T1_SCOLQ18M_D","A09R_T1_SCOLQ18M_D",null,312,"donnée","dico",null,"E9AREF_COCHE",null,null,"","","","","","","",null,"TRAVAIL SCOLAIRE PENDANT LE CONFINEMENT"]
[null,null,null,"Depuis le début du confinement, avez-vous utilisé le dispositif du CNED « ma classe à la maison » ?","T1_SCOLQ19","A09R_T1_SCOLQ19",null,313,"donnée","dico",null,"E9AREF_SCOLAR12F",null,null,"","","","","","","",null,"TRAVAIL SCOLAIRE PENDANT LE CONFINEMENT",null,0]
[null,null,null,"SORTIES",null,null,null,null,null,null,null,null,null,null,null,null,null,null,null,null,null,null,null,null,1]
[null,null,null,"Au cours de la journée d’hier, êtes-vous sorti.e de votre logement ?","T1_SORTIEQ01","A09R_T1_SORTIEQ01",null,314,"donnée","dico",null,"E9AREF_YORN",null,null,"","","","","","","",null,"SORTIES"]
[null,null,null,"Parmi les autres personnes qui partagent votre logement, combien sont sorti.e.s de votre logement dans la journée d’hier quel qu’en soit le motif ?","T1_SORTIEQ02","A09R_T1_SORTIEQ02",null,315,"donnée","dico",null,"",null,null,"","","","","","","",null,"SORTIES"]
[null,null,null,"Toujours au cours de la journée d’hier, votre enfant est-il sorti de votre domicile ?","T1_SORTIEQ03","A09R_T1_SORTIEQ03",null,316,"donnée","dico",null,"E9AREF_YORN_NSP_F",null,null,"","","","","","","",null,"SORTIES"]
[null,null,null,"La dernière fois que votre enfant est sorti, était-ce : Pour accompagner un adulte lors des achats de première nécessité","T1_SORTIEQ04M_A","A09R_T1_SORTIEQ04M_A",null,317,"donnée","dico",null,"E9AREF_COCHE",null,null,"","","","","","","",null,"SORTIES"]
[null,null,null,"La dernière fois que votre enfant est sorti, était-ce : Pour faire lui-même des achats de première nécessité","T1_SORTIEQ04M_B","A09R_T1_SORTIEQ04M_B",null,318,"donnée","dico",null,"E9AREF_COCHE",null,null,"","","","","","","",null,"SORTIES"]
[null,null,null,"La dernière fois que votre enfant est sorti, était-ce : Pour motif de santé","T1_SORTIEQ04M_C","A09R_T1_SORTIEQ04M_C",null,319,"donnée","dico",null,"E9AREF_COCHE",null,null,"","","","","","","",null,"SORTIES"]
[null,null,null,"La dernière fois que votre enfant est sorti, était-ce : Pour jouer dehors, faire de l’exercice physique ou promener des animaux de compagnie","T1_SORTIEQ04M_D","A09R_T1_SORTIEQ04M_D",null,320,"donnée","dico",null,"E9AREF_COCHE",null,null,"","","","","","","",null,"SORTIES"]
[null,null,null,"La dernière fois que votre enfant est sorti, était-ce :Pour une autre raison (voir un ami, loisirs, etc.)","T1_SORTIEQ04M_E","A09R_T1_SORTIEQ04M_E",null,321,"donnée","dico",null,"E9AREF_COCHE",null,null,"","","","","","","",null,"SORTIES"]
[null,null,null,"Au total, la dernière fois qu’il est sorti combien de temps la sortie a-t-elle duré ?","T1_SORTIEQ05","A09R_T1_SORTIEQ05",null,322,"donnée","dico",null,"E9AREF_SORTIES2F",null,null,"","","","","","","",null,"SORTIES"]
[null,null,null,"Quel(s) moyen(s) de transport a-t-il/elle emprunté(s) au cours de cette dernière sortie ? Marche, vélo, trottinette","T1_SORTIEQ06M_A","A09R_T1_SORTIEQ06M_A",null,323,"donnée","dico",null,"E9AREF_COCHE",null,null,"","","","","","","",null,"SORTIES"]
[null,null,null,"Quel(s) moyen(s) de transport a-t-il/elle emprunté(s) au cours de cette dernière sortie ? Voiture","T1_SORTIEQ06M_B","A09R_T1_SORTIEQ06M_B",null,324,"donnée","dico",null,"E9AREF_COCHE",null,null,"","","","","","","",null,"SORTIES"]
[null,null,null,"Quel(s) moyen(s) de transport a-t-il/elle emprunté(s) au cours de cette dernière sortie ? Moto ou scooter","T1_SORTIEQ06M_C","A09R_T1_SORTIEQ06M_C",null,325,"donnée","dico",null,"E9AREF_COCHE",null,null,"","","","","","","",null,"SORTIES"]
[null,null,null,"Quel(s) moyen(s) de transport a-t-il/elle emprunté(s) au cours de cette dernière sortie ? Taxi","T1_SORTIEQ06M_D","A09R_T1_SORTIEQ06M_D",null,326,"donnée","dico",null,"E9AREF_COCHE",null,null,"","","","","","","",null,"SORTIES"]
[null,null,null,"Quel(s) moyen(s) de transport a-t-il/elle emprunté(s) au cours de cette dernière sortie ? Transports en commun (bus, autocar, tramway, métro, RER, train)","T1_SORTIEQ06M_E","A09R_T1_SORTIEQ06M_E",null,327,"donnée","dico",null,"E9AREF_COCHE",null,null,"","","","","","","",null,"SORTIES"]
[null,null,null,"Quel(s) moyen(s) de transport a-t-il/elle emprunté(s) au cours de cette dernière sortie ? Autre","T1_SORTIEQ06M_F","A09R_T1_SORTIEQ06M_F",null,328,"donnée","dico",null,"E9AREF_COCHE",null,null,"","","","","","","",null,"SORTIES"]
[null,null,null,"Votre enfant s’est-il lavé les mains au savon ou avec une solution hydro-alcoolique en revenant à votre logement ?","T1_SORTIEQ07","A09R_T1_SORTIEQ07",null,329,"donnée","dico",null,"E9AREF_SORTIES4F",null,null,"","","","","","","",null,"SORTIES"]
[null,null,null,"Lors de ses déplacements à l’extérieur, votre enfant portait-il une protection respiratoire (masque médical, masque en tissu, masque de chantier, écharpe, foulard) ?","T1_SORTIEQ08","A09R_T1_SORTIEQ08",null,330,"donnée","dico",null,"E9AREF_SORTIES5F",null,null,"","","","","","","",null,"SORTIES"]
[null,null,null,"Votre enfant a-t-il pu se maintenir à plus d’un mètre des personnes qu’il a rencontrées à l’extérieur de votre logement ?","T1_SORTIEQ09","A09R_T1_SORTIEQ09",null,331,"donnée","dico",null,"E9AREF_SORTIES6F",null,null,"","","","","","","",null,"SORTIES"]
[null,null,null,"Combien de fois votre enfant est-il sorti de votre domicile dans les 7 derniers jours ?","T1_SORTIEQ10","A09R_T1_SORTIEQ10",null,332,"donnée","dico",null,"E9AREF_SORTIES7F",null,null,"","","","","","","",null,"SORTIES"]
[null,null,null,"Diriez-vous que votre enfant vit mal le fait d’être limité dans ses sorties ?","T1_SORTIEQ11","A09R_T1_SORTIEQ11",null,333,"donnée","dico",null,"E9AREF_SORTIES8F",null,null,"","","","","","","",null,"SORTIES"]
[null,null,null,"Est-ce parce que : Il ne va plus à l’école","T1_SORTIEQ12M_A","A09R_T1_SORTIEQ12M_A",null,334,"donnée","dico",null,"E9AREF_COCHE",null,null,"","","","","","","",null,"SORTIES"]
[null,null,null,"Est-ce parce que : Il ne voit plus ses copains/copines","T1_SORTIEQ12M_B","A09R_T1_SORTIEQ12M_B",null,335,"donnée","dico",null,"E9AREF_COCHE",null,null,"","","","","","","",null,"SORTIES"]
[null,null,null,"Est-ce parce que : Il ne va plus à ses activités sportives et/ou artistiques","T1_SORTIEQ12M_C","A09R_T1_SORTIEQ12M_C",null,336,"donnée","dico",null,"E9AREF_COCHE",null,null,"","","","","","","",null,"SORTIES"]
[null,null,null,"Est-ce parce que : Il ne voit plus les autres membres de sa famille","T1_SORTIEQ12M_D","A09R_T1_SORTIEQ12M_D",null,337,"donnée","dico",null,"E9AREF_COCHE",null,null,"","","","","","","",null,"SORTIES"]
[null,null,null,"Est-ce parce que : Pour d’autres raisons","T1_SORTIEQ12M_E","A09R_T1_SORTIEQ12M_E",null,338,"donnée","dico",null,"E9AREF_COCHE",null,null,"","","","","","","",null,"SORTIES"]
[null,null,null,"Dans l’ensemble, votre enfant a-t-il compris facilement les gestes barrières?","T1_SORTIEQ13","A09R_T1_SORTIEQ13",null,339,"donnée","dico",null,"E9AREF_SORTIES10F",null,null,"","","","","","","",null,"SORTIES",null,0]
[null,null,null,"OPINIONS SUR L’ÉPIDÉMIE\n",null,null,null,null,null,null,null,null,null,null,null,null,null,null,null,null,null,null,null,null,1]
[null,null,null,"Diriez-vous que votre enfant se demande s'il pourrait attraper le coronavirus ?","T1_OPINIONQ01","A09R_T1_OPINIONQ01",null,340,"donnée","dico",null,"E9AREF_EPID5F",null,null,"","","","","","","",null,"OPINIONS SUR L’ÉPIDÉMIE\n"]
[null,null,null,"Vous personnellement, craignez-vous d'attraper le coronavirus ?","T1_OPINIONQ02","A09R_T1_OPINIONQ02",null,341,"donnée","dico",null,"E9AREF_EPID1F",null,null,"","","","","","","",null,"OPINIONS SUR L’ÉPIDÉMIE\n"]
[null,null,null,"A votre avis, le coronavirus se transmet-il lorsqu’on se promène dehors en restant à plus d'un mètre des autres","T1_OPINIONQ03","A09R_T1_OPINIONQ03",null,342,"donnée","dico",null,"E9AREF_EPID2F",null,null,"","","","","","","",null,"OPINIONS SUR L’ÉPIDÉMIE\n"]
[null,null,null,"A votre avis, le coronavirus se transmet-il lorsqu’on touche un objet qu’une personne malade vient de toucher","T1_OPINIONQ04","A09R_T1_OPINIONQ04",null,343,"donnée","dico",null,"E9AREF_EPID2F",null,null,"","","","","","","",null,"OPINIONS SUR L’ÉPIDÉMIE\n"]
[null,null,null,"A votre avis, est-ce qu'une personne qui ne présente aucun signe de la maladie peut transmettre le coronavirus ?","T1_OPINIONQ05","A09R_T1_OPINIONQ05",null,344,"donnée","dico",null,"E9AREF_EPID2F",null,null,"","","","","","","",null,"OPINIONS SUR L’ÉPIDÉMIE\n"]
[null,null,null,"Parmi les propositions suivantes, quelle est celle qui correspond le mieux à ce que vous pensez ?","T1_OPINIONQ06","A09R_T1_OPINIONQ06",null,345,"donnée","dico",null,"E9AREF_EPID3F",null,null,"","","","","","","",null,"OPINIONS SUR L’ÉPIDÉMIE\n"]
[null,null,null,"Pour vous informer sur la crise du coronavirus, faites-vous confiance dans ce que disent les médecins ?","T1_OPINIONQ07","A09R_T1_OPINIONQ07",null,346,"donnée","dico",null,"E9AREF_EPID4F",null,null,"","","","","","","",null,"OPINIONS SUR L’ÉPIDÉMIE\n"]
[null,null,null,"Pour vous informer sur la crise du coronavirus, faites-vous confiance dans ce que dit le gouvernement ?","T1_OPINIONQ08","A09R_T1_OPINIONQ08",null,347,"donnée","dico",null,"E9AREF_EPID4F",null,null,"","","","","","","",null,"OPINIONS SUR L’ÉPIDÉMIE\n"]
[null,null,null,"Pour vous informer sur la crise du coronavirus, faites-vous confiance dans ce que disent les chercheurs ?","T1_OPINIONQ09","A09R_T1_OPINIONQ09",null,348,"donnée","dico",null,"E9AREF_EPID4F",null,null,"","","","","","","",null,"OPINIONS SUR L’ÉPIDÉMIE\n"]
[null,null,null,"Pour vous informer sur la crise du coronavirus, faites-vous confiance dans ce que disent les journalistes ?","T1_OPINIONQ10","A09R_T1_OPINIONQ10",null,349,"donnée","dico",null,"E9AREF_EPID4F",null,null,"","","","","","","",null,"OPINIONS SUR L’ÉPIDÉMIE\n"]
[null,null,null,"Pour vous informer sur la crise du coronavirus, faites-vous confiance dans ce que disent les réseaux sociaux ?","T1_OPINIONQ11","A09R_T1_OPINIONQ11",null,350,"donnée","dico",null,"E9AREF_EPID4F",null,null,"","","","","","","",null,"OPINIONS SUR L’ÉPIDÉMIE\n"]
[null,null,null,"Pour résoudre la crise du coronavirus, est-ce que vous avez confiance dans l’action des pouvoirs publics ?","T1_OPINIONQ12","A09R_T1_OPINIONQ12",null,351,"donnée","dico",null,"E9AREF_EPID4F",null,null,"","","","","","","",null,"OPINIONS SUR L’ÉPIDÉMIE\n"]
[null,null,null,"Pour résoudre la crise du coronavirus, est-ce que vous avez confiance dans la capacité des scientifiques à trouver des solutions ?","T1_OPINIONQ13","A09R_T1_OPINIONQ13",null,352,"donnée","dico",null,"E9AREF_EPID4F",null,null,"","","","","","","",null,"OPINIONS SUR L’ÉPIDÉMIE\n"]
[null,null,null,"Etes-vous d'accord ou pas avec l'opinion suivante : Les dépenses de santé sont trop élevées en France","T1_OPINIONQ14","A09R_T1_OPINIONQ14",null,353,"donnée","dico",null,"E9AREF_EPID4F",null,null,"","","","","","","",null,"OPINIONS SUR L’ÉPIDÉMIE\n"]
[null,null,null,"Etes-vous d'accord ou pas avec l'opinion suivante : Il n'y a pas de raison de limiter les dépenses car la santé n'a pas de prix","T1_OPINIONQ15","A09R_T1_OPINIONQ15",null,354,"donnée","dico",null,"E9AREF_EPID4F",null,null,"","","","","","","",null,"OPINIONS SUR L’ÉPIDÉMIE\n"]
[null,null,null,"Etes-vous d'accord ou pas avec l'opinion suivante : En France, tout le monde est soigné de la même manière quel que soit le lieu où on habite","T1_OPINIONQ16","A09R_T1_OPINIONQ16",null,355,"donnée","dico",null,"E9AREF_EPID4F",null,null,"","","","","","","",null,"OPINIONS SUR L’ÉPIDÉMIE\n"]
[null,null,null,"Etes-vous d'accord ou pas avec l'opinion suivante : L’Etat devrait consacrer plus d’argent aux hôpitaux publics","T1_OPINIONQ17","A09R_T1_OPINIONQ17",null,356,"donnée","dico",null,"E9AREF_EPID4F",null,null,"","","","","","","",null,"OPINIONS SUR L’ÉPIDÉMIE\n"]
[null,null,null,"Diriez-vous qu’aujourd’hui, vous êtes :","T1_OPINIONQ18","A09R_T1_OPINIONQ18",null,357,"donnée","dico",null,"E9AREF_EPID7F",null,null,"","","","","","","",null,"OPINIONS SUR L’ÉPIDÉMIE\n"]
[null,null,null,"Pour votre vie de famille, le confinement a-t-il eu des effets :","T1_OPINIONQ19","A09R_T1_OPINIONQ19",null,358,"donnée","dico",null,"E9AREF_EPID6F",null,null,"","","","","","","",null,"OPINIONS SUR L’ÉPIDÉMIE\n",null,0]

{"sheet":"E9A_COVID_T2","index":11,"n_rows":494,"n_cols":72,"rows_kept":494,"cut":false,"hidden":false,"merged":[]}
["SELECTION\n(par variable ou par section)","SELECTION\n(par thème 1)","SELECTION\n(par QUEST STANDARD)","LABEL","QUESTION QUESTIONNAIRE","QUESTION BASE","QUESTION BASE",null,"TYPE","FORMAT","CHAPEAU","DICO","DESCRIPTION","CONTRÔLE","THEME(01)","THEME(02)","THEME(03)","THEME1","THEME2","THEME3","THEME4","THEME5","THEME6","QUEST STANDARD","THEME_TITRE","","","","","","","","","","","","","","","","","","","","","","","","","","E9A_SAPRIS_T2","E9A_SAPRIS_T2","","","","","","","","","","","","","","","","","","","",""]
[null,null,null,{"$f":"CONCATENATE(\"Sélection totale : \",COUNTIFS(A:A,\"X\",I:I,\"*\")+COUNTIFS(B:B,\"X\",I:I,\"*\")+COUNTIFS(C:C,\"X\",I:I,\"*\"),\" variable(s)\")","v":"Sélection totale : 0 variable(s)"},null,null,null,null,null,null,null,null,null,null,null,null,null,null,null,null,null,null,null,null,null,null,{"$f":"COUNTIFS(A:A,\"X\",I:I,\"non-disponible\")+COUNTIFS(B:B,\"X\",I:I,\"non-disponible\")+COUNTIFS(C:C,\"X\",I:I,\"non-disponible\")","v":0},{"$f":"SUM(COUNTIFS($A:$A,\"X\",$E:$E,{\"ACRELI\";\"ACCHRET\";\"ACMUSUL\";\"LRELI\";\"QLCHRET\";\"QLMUSUL\";\"POLIT\"})+COUNTIFS($B:$B,\"X\",$E:$E,{\"ACRELI\";\"ACCHRET\";\"ACMUSUL\";\"LRELI\";\"QLCHRET\";\"QLMUSUL\";\"POLIT\"})+COUNTIFS($C:$C,\"X\",$E:$E,{\"ACRELI\";\"ACCHRET\";\"ACMUSUL\";\"LRELI\";\"QLCHRET\";\"QLMUSUL\";\"POLIT\"}))","v":0}]
[null,null,null,"GESTION",null,null,null,null,null,null,null,null,null,null,null,null,null,null,null,null,null,null,null,null,1]
[null,null,null,"Date de la première modalité remplie (Jour)","T2_DATPREMQUESTJ","A09R_T2_DATPREMQUESTJ",null,3,"donnée","dico",null,"",null,null,"","","","","","","",null,"GESTION"]
[null,null,null,"Date de la première modalité remplie (Mois)","T2_DATPREMQUESTM","A09R_T2_DATPREMQUESTM",null,4,"donnée","dico",null,"",null,null,"","","","","","","",null,"GESTION"]
[null,null,null,"Date de la première modalité remplie (Année)","T2_DATPREMQUESTA","A09R_T2_DATPREMQUESTA",null,5,"donnée","dico",null,"",null,null,"","","","","","","",null,"GESTION"]
[null,null,null,"Date de la dernière modalité remplie (Jour)","T2_DATDERQUESTJ","A09R_T2_DATDERQUESTJ",null,6,"donnée","dico",null,"",null,null,"","","","","","","",null,"GESTION"]
[null,null,null,"Date de la dernière modalité remplie (Mois)","T2_DATDERQUESTM","A09R_T2_DATDERQUESTM",null,7,"donnée","dico",null,"",null,null,"","","","","","","",null,"GESTION"]
[null,null,null,"Date de la dernière modalité remplie (Année)","T2_DATDERQUESTA","A09R_T2_DATDERQUESTA",null,8,"donnée","dico",null,"",null,null,"","","","","","","",null,"GESTION",null,0]
[null,null,null,"SITUATION FAMILIALE ET LOGEMENT",null,null,null,null,null,null,null,null,null,null,null,null,null,null,null,null,null,null,null,null,1]
[null,null,null,"Ce questionnaire est le deuxième de la série de questionnaires que nous vous enverrons dans le contexte de l’épidémie COVID-19. Avez-vous répondu intégralement au premier questionnaire qui vous a été adressé le 16 avril 2020 ?","T2_Q01","A09R_T2_Q01",null,9,"donnée","dico",null,"E9AREF_YORN_NSP_F",null,null,"","","","","","","",null,"SITUATION FAMILIALE ET LOGEMENT"]
[null,null,null,"Tout d'abord, pouvez-vous nous indiquer si vous êtes parents de jumeaux, triplés ou quadruplés nés en 2011 ?","T2_JU01","A09R_T2_JU01",null,10,"donnée","dico",null,"E9AREF_YORN",null,null,"","","","","","","",null,"SITUATION FAMILIALE ET LOGEMENT"]
[null,null,null,"Répondez-vous pour le premier enfant ?","T2_JU02","A09R_T2_JU02",null,11,"donnée","dico",null,"E9AREF_YORN",null,null,"","","","","","","",null,"SITUATION FAMILIALE ET LOGEMENT"]
[null,null,null,"Indiquez le prénom de l’enfant pour lequel vous remplissez ce questionnaire :","T2_JU03","A09R_T2_JU03",null,12,"non-disponible","text",null,"",null,null,"","","","","","","",null,"SITUATION FAMILIALE ET LOGEMENT"]
[null,null,null,"Vous êtes :","T2_FOYERQ01","A09R_T2_FOYERQ01",null,13,"donnée","dico",null,"E9AREF_FOYER1MODIF",null,null,"","","","","","","",null,"SITUATION FAMILIALE ET LOGEMENT"]
[null,null,null,"Avec qui habite cet enfant (né en 2011) en ce moment ?","T2_FOYERQ02","A09R_T2_FOYERQ02",null,14,"donnée","dico",null,"E9AREF_FOYER2F",null,null,"","","","","","","",null,"SITUATION FAMILIALE ET LOGEMENT"]
[null,null,null,"Depuis le début du confinement, votre enfant a-t-il changé de domicile parental ?","T2_FOYERQ02TER","A09R_T2_FOYERQ02TER",null,15,"donnée","dico",null,"E9AREF_FOYER2TER",null,null,"","","","","","","",null,"SITUATION FAMILIALE ET LOGEMENT"]
[null,null,null,"Depuis le début du confinement, combien de fois votre enfant est-il venu dormir chez vous ?","T2_FOYERQ29","A09R_T2_FOYERQ29",null,16,"donnée","dico",null,"E9AREF_FOYER10F",null,null,"","","","","","","",null,"SITUATION FAMILIALE ET LOGEMENT"]
[null,null,null,"Avant le confinement, votre enfant avait-il l'habitude de dormir chez vous ?","T2_FOYERQ30BIS","A09R_T2_FOYERQ30BIS",null,17,"donnée","dico",null,"E9AREF_YORN",null,null,"","","","","","","",null,"SITUATION FAMILIALE ET LOGEMENT"]
[null,null,null,"Est-il venu ?","T2_FOYERQ30","A09R_T2_FOYERQ30",null,18,"donnée","dico",null,"E9AREF_FOYER11F",null,null,"","","","","","","",null,"SITUATION FAMILIALE ET LOGEMENT"]
[null,null,null,"Avez-vous des contacts (de visu, téléphonique ou visio) avec votre enfant depuis le confinement ?","T2_FOYERQ31","A09R_T2_FOYERQ31",null,19,"donnée","dico",null,"E9AREF_FOYER12F",null,null,"","","","","","","",null,"SITUATION FAMILIALE ET LOGEMENT"]
[null,null,null,"Diriez-vous que votre relation avec l’autre parent a changé depuis le début du confinement ?","T2_FOYERQ32","A09R_T2_FOYERQ32",null,20,"donnée","dico",null,"E9AREF_FOYER13F",null,null,"","","","","","","",null,"SITUATION FAMILIALE ET LOGEMENT"]
[null,null,null,"Avez-vous eu des désaccords à propos de votre enfant durant le confinement ?","T2_FOYERQ33","A09R_T2_FOYERQ33",null,21,"donnée","dico",null,"E9AREF_YORN",null,null,"","","","","","","",null,"SITUATION FAMILIALE ET LOGEMENT"]
[null,null,null,"Est-ce que ces désaccord(s) ont porté sur : Le temps passé chez l’un ou l’autre des parents","T2_FOYERQ34M_A","A09R_T2_FOYERQ34M_A",null,22,"donnée","dico",null,"E9AREF_COCHE",null,null,"","","","","","","",null,"SITUATION FAMILIALE ET LOGEMENT"]
[null,null,null,"Est-ce que ces désaccord(s) ont porté sur : Son travail scolaire","T2_FOYERQ34M_B","A09R_T2_FOYERQ34M_B",null,23,"donnée","dico",null,"E9AREF_COCHE",null,null,"","","","","","","",null,"SITUATION FAMILIALE ET LOGEMENT"]
[null,null,null,"Est-ce que ces désaccord(s) ont porté sur : L’application des gestes barrières","T2_FOYERQ34M_C","A09R_T2_FOYERQ34M_C",null,24,"donnée","dico",null,"E9AREF_COCHE",null,null,"","","","","","","",null,"SITUATION FAMILIALE ET LOGEMENT"]
[null,null,null,"Est-ce que ces désaccord(s) ont porté sur : Ses sorties dans l’espace public","T2_FOYERQ34M_D","A09R_T2_FOYERQ34M_D",null,25,"donnée","dico",null,"E9AREF_COCHE",null,null,"","","","","","","",null,"SITUATION FAMILIALE ET LOGEMENT"]
[null,null,null,"Est-ce que ces désaccord(s) ont porté sur : Des questions financières","T2_FOYERQ34M_E","A09R_T2_FOYERQ34M_E",null,26,"donnée","dico",null,"E9AREF_COCHE",null,null,"","","","","","","",null,"SITUATION FAMILIALE ET LOGEMENT"]
[null,null,null,"Avez-vous actuellement un.e conjoint.e présent.e dans ce logement ?","T2_FOYERQ03","A09R_T2_FOYERQ03",null,27,"donnée","dico",null,"E9AREF_YORN",null,null,"","","","","","","",null,"SITUATION FAMILIALE ET LOGEMENT"]
[null,null,null,"Avez-vous changé de logement dans les 15 derniers jours ?","T2_FOYERQ04BIS","A09R_T2_FOYERQ04BIS",null,28,"donnée","dico",null,"E9AREF_YORN",null,null,"","","","","","","",null,"SITUATION FAMILIALE ET LOGEMENT"]
[null,null,null,"Habitez-vous actuellement dans votre logement habituel ?","T2_FOYERQ04","A09R_T2_FOYERQ04",null,29,"donnée","dico",null,"E9AREF_YORN",null,null,"","","","","","","",null,"SITUATION FAMILIALE ET LOGEMENT"]
[null,null,null,"Où habitez-vous en ce moment ?","T2_FOYERQ05","A09R_T2_FOYERQ05",null,30,"donnée","dico",null,"E9AREF_FOYER3F",null,null,"","","","","","","",null,"SITUATION FAMILIALE ET LOGEMENT"]
[null,null,null,"Quel est le département de votre logement actuel ?","T2_FOYERQ06","A09R_T2_FOYERQ06",null,31,"non-disponible","dico",null,"",null,null,"","","","","","","",null,"SITUATION FAMILIALE ET LOGEMENT"]
[null,null,null,"Dernier département d'habitation connu","T2_DEPHAB","A09R_T2_DEPHAB",null,32,"non-disponible","text",null,"",null,null,"","","","","","","",null,"SITUATION FAMILIALE ET LOGEMENT"]
[null,null,null,"Vous habitez en ce moment ?","T2_FOYERQ07","A09R_T2_FOYERQ07",null,33,"donnée","dico",null,"E9AREF_FOYER6F",null,null,"","","","","","","",null,"SITUATION FAMILIALE ET LOGEMENT"]
[null,null,null,"Votre logement actuel est :","T2_FOYERQ08","A09R_T2_FOYERQ08",null,34,"donnée","dico",null,"E9AREF_FOYER4F",null,null,"","","","","","","",null,"SITUATION FAMILIALE ET LOGEMENT"]
[null,null,null,"Disposez-vous d’une cour ou d’un jardin privatifs ?","T2_FOYERQ09","A09R_T2_FOYERQ09",null,35,"donnée","dico",null,"E9AREF_YORN",null,null,"","","","","","","",null,"SITUATION FAMILIALE ET LOGEMENT"]
[null,null,null,"Disposez-vous d’un balcon ou d’une terrasse ?","T2_FOYERQ10","A09R_T2_FOYERQ10",null,36,"donnée","dico",null,"E9AREF_YORN",null,null,"","","","","","","",null,"SITUATION FAMILIALE ET LOGEMENT"]
[null,null,null,"Disposez-vous d’une cour ou d’un jardin collectifs ?","T2_FOYERQ11","A09R_T2_FOYERQ11",null,37,"donnée","dico",null,"E9AREF_YORN",null,null,"","","","","","","",null,"SITUATION FAMILIALE ET LOGEMENT"]
[null,null,null,"Quel est le nombre de pièces du logement que vous occupez aujourd’hui (sans compter la cuisine et la salle de bain) ?","T2_FOYERQ12","A09R_T2_FOYERQ12",null,38,"donnée","dico",null,"",null,null,"","","","","","","",null,"SITUATION FAMILIALE ET LOGEMENT"]
[null,null,null,"Combien de personnes vivent actuellement dans ce logement, y compris vous-même ?","T2_FOYERQ13","A09R_T2_FOYERQ13",null,39,"donnée","dico",null,"",null,null,"","","","","","","",null,"SITUATION FAMILIALE ET LOGEMENT"]
[null,null,null,"Parmi elles, combien votre enfant a-t-il de frères/sœurs, demi-frères/sœurs (ou enfant(s) issu(s) d’une autre union) ?","T2_FOYERQ14","A09R_T2_FOYERQ14",null,40,"donnée","dico",null,"",null,null,"","","","","","","",null,"SITUATION FAMILIALE ET LOGEMENT"]
[null,null,null,"Quel est l’âge du plus âgé de ces enfants ?","T2_FOYERQ15","A09R_T2_FOYERQ15",null,41,"donnée","dico",null,"",null,null,"","","","","","","",null,"SITUATION FAMILIALE ET LOGEMENT"]
[null,null,null,"Quel est l’âge du plus jeune de ces enfants ?","T2_FOYERQ16","A09R_T2_FOYERQ16",null,42,"donnée","dico",null,"",null,null,"","","","","","","",null,"SITUATION FAMILIALE ET LOGEMENT"]
[null,null,null,"Quel est l’âge de cet autre enfant ?","T2_FOYERQ17","A09R_T2_FOYERQ17",null,43,"donnée","dico",null,"",null,null,"","","","","","","",null,"SITUATION FAMILIALE ET LOGEMENT"]
[null,null,null,"Suite au confinement, une ou plusieurs personnes vous ont-elles rejoint.e (qui habituellement vivent ailleurs) ?","T2_FOYERQ18","A09R_T2_FOYERQ18",null,44,"donnée","dico",null,"E9AREF_YORN",null,null,"","","","","","","",null,"SITUATION FAMILIALE ET LOGEMENT"]
[null,null,null,"Quel est son/leurs lien(s) avec votre enfant ? L'autre parent","T2_FOYERQ19M_A","A09R_T2_FOYERQ19M_A",null,45,"donnée","dico",null,"E9AREF_COCHE",null,null,"","","","","","","",null,"SITUATION FAMILIALE ET LOGEMENT"]
[null,null,null,"Quel est son/leurs lien(s) avec votre enfant ? Frère(s)/sœur(s) (ou demi-frère/sœur)","T2_FOYERQ19M_B","A09R_T2_FOYERQ19M_B",null,46,"donnée","dico",null,"E9AREF_COCHE",null,null,"","","","","","","",null,"SITUATION FAMILIALE ET LOGEMENT"]
[null,null,null,"Quel est son/leurs lien(s) avec votre enfant ? Grand(s)-parent(s)","T2_FOYERQ19M_C","A09R_T2_FOYERQ19M_C",null,47,"donnée","dico",null,"E9AREF_COCHE",null,null,"","","","","","","",null,"SITUATION FAMILIALE ET LOGEMENT"]
[null,null,null,"Quel est son/leurs lien(s) avec votre enfant ? Autre membre de la famille","T2_FOYERQ19M_D","A09R_T2_FOYERQ19M_D",null,48,"donnée","dico",null,"E9AREF_COCHE",null,null,"","","","","","","",null,"SITUATION FAMILIALE ET LOGEMENT"]
[null,null,null,"Quel est son/leurs lien(s) avec votre enfant ? Personne sans lien de parenté","T2_FOYERQ19M_E","A09R_T2_FOYERQ19M_E",null,49,"donnée","dico",null,"E9AREF_COCHE",null,null,"","","","","","","",null,"SITUATION FAMILIALE ET LOGEMENT"]
[null,null,null,"Suite au confinement, une ou plusieurs personnes qui vivent habituellement dans ce logement, l’ont-elles quitté.e ?","T2_FOYERQ20","A09R_T2_FOYERQ20",null,50,"donnée","dico",null,"E9AREF_YORN",null,null,"","","","","","","",null,"SITUATION FAMILIALE ET LOGEMENT"]
[null,null,null,"Quel est son/leurs lien(s) avec votre enfant ? L'autre parent","T2_FOYERQ21M_A","A09R_T2_FOYERQ21M_A",null,51,"donnée","dico",null,"E9AREF_COCHE",null,null,"","","","","","","",null,"SITUATION FAMILIALE ET LOGEMENT"]
[null,null,null,"Quel est son/leurs lien(s) avec votre enfant ? Frère(s)/sœur(s) (ou demi-frère/sœur)","T2_FOYERQ21M_B","A09R_T2_FOYERQ21M_B",null,52,"donnée","dico",null,"E9AREF_COCHE",null,null,"","","","","","","",null,"SITUATION FAMILIALE ET LOGEMENT"]
[null,null,null,"Quel est son/leurs lien(s) avec votre enfant ? Grand(s)-parent(s)","T2_FOYERQ21M_C","A09R_T2_FOYERQ21M_C",null,53,"donnée","dico",null,"E9AREF_COCHE",null,null,"","","","","","","",null,"SITUATION FAMILIALE ET LOGEMENT"]
[null,null,null,"Quel est son/leurs lien(s) avec votre enfant ? Autre membre de la famille","T2_FOYERQ21M_D","A09R_T2_FOYERQ21M_D",null,54,"donnée","dico",null,"E9AREF_COCHE",null,null,"","","","","","","",null,"SITUATION FAMILIALE ET LOGEMENT"]
[null,null,null,"Quel est son/leurs lien(s) avec votre enfant ? Personne sans lien de parenté","T2_FOYERQ21M_E","A09R_T2_FOYERQ21M_E",null,55,"donnée","dico",null,"E9AREF_COCHE",null,null,"","","","","","","",null,"SITUATION FAMILIALE ET LOGEMENT"]
[null,null,null,"Votre enfant a-t-il un ou plusieurs demi-frères et/ou demi-sœurs (ou frères, sœurs, autres enfants nés d’une autre union) ne vivant pas dans ce domicile ?","T2_FOYERQ22","A09R_T2_FOYERQ22",null,56,"donnée","dico",null,"E9AREF_FOYER8F",null,null,"","","","","","","",null,"SITUATION FAMILIALE ET LOGEMENT"]
[null,null,null,"Depuis le début du confinement, votre enfant l’a-t-il vu.e ?","T2_FOYERQ23","A09R_T2_FOYERQ23",null,57,"donnée","dico",null,"E9AREF_YORN",null,null,"","","","","","","",null,"SITUATION FAMILIALE ET LOGEMENT"]
[null,null,null,"Est-il/elle venu.e dormir chez vous ?","T2_FOYERQ24","A09R_T2_FOYERQ24",null,58,"donnée","dico",null,"E9AREF_YORN",null,null,"","","","","","","",null,"SITUATION FAMILIALE ET LOGEMENT"]
[null,null,null,"Depuis le début du confinement, votre enfant les a-t-il vu.es ?","T2_FOYERQ25","A09R_T2_FOYERQ25",null,59,"donnée","dico",null,"E9AREF_FOYER9F",null,null,"","","","","","","",null,"SITUATION FAMILIALE ET LOGEMENT"]
[null,null,null,"Sont-ils/elles venu.es dormir chez vous ?","T2_FOYERQ26","A09R_T2_FOYERQ26",null,60,"donnée","dico",null,"E9AREF_FOYER9F",null,null,"","","","","","","",null,"SITUATION FAMILIALE ET LOGEMENT"]
[null,null,null,"Depuis le début du confinement, combien de fois votre enfant est-il allé dormir chez son autre parent ?","T2_FOYERQ27","A09R_T2_FOYERQ27",null,61,"donnée","dico",null,"E9AREF_FOYER10F",null,null,"","","","","","","",null,"SITUATION FAMILIALE ET LOGEMENT"]
[null,null,null,"Y est-il allé ?","T2_FOYERQ28","A09R_T2_FOYERQ28",null,62,"donnée","dico",null,"E9AREF_FOYER11F",null,null,"","","","","","","",null,"SITUATION FAMILIALE ET LOGEMENT",null,0]
[null,null,null,"CONDITIONS DE VIE",null,null,null,null,null,null,null,null,null,null,null,null,null,null,null,null,null,null,null,null,1]
[null,null,null,"Avant le confinement quel était le montant total des revenus mensuels nets de votre foyer (c’est-à-dire la somme des revenus des personnes de votre foyer quelle qu’en soit l’origine) ?","T2_REVENUQ01","A09R_T2_REVENUQ01",null,63,"donnée","dico",null,"E9AREF_REVENU1F",null,null,"","","","","","","",null,"CONDITIONS DE VIE"]
[null,null,null,"Si vous vendiez tous vos biens (résidence principale, résidence secondaire, mobilier, voiture, bijoux, etc., et après remboursement de vos éventuels crédits) à quelle somme pensez-vous que cela correspondrait ?","T2_REVENUQ02","A09R_T2_REVENUQ02",null,64,"donnée","dico",null,"E9AREF_REVENU2F",null,null,"","","","","","","",null,"CONDITIONS DE VIE",null,0]
[null,null,null,"SANTÉ DE L’ENFANT",null,null,null,null,null,null,null,null,null,null,null,null,null,null,null,null,null,null,null,null,1]
[null,null,null,"Votre enfant a-t-il une maladie chronique et /ou des difficultés dans son développement, c’est-à-dire une maladie ou une difficulté qui dure depuis au moins 6 mois et qui peut nécessiter des soins ou un traitement réguliers ?","T2_SANTEQ01","A09R_T2_SANTEQ01",null,65,"donnée","dico",null,"E9AREF_YORN_NSP_F",null,null,"","","","","","","",null,"SANTÉ DE L’ENFANT"]
[null,null,null,"De quelle(s) maladie(s) ou difficulté(s) s’agit-il ? Asthme ou autre maladie respiratoire","T2_SANTEQ02M_A","A09R_T2_SANTEQ02M_A",null,66,"donnée","dico",null,"E9AREF_COCHE",null,null,"","","","","","","",null,"SANTÉ DE L’ENFANT"]
[null,null,null,"De quelle(s) maladie(s) ou difficulté(s) s’agit-il ? Maladie ou malformation cardiaque","T2_SANTEQ02M_B","A09R_T2_SANTEQ02M_B",null,67,"donnée","dico",null,"E9AREF_COCHE",null,null,"","","","","","","",null,"SANTÉ DE L’ENFANT"]
[null,null,null,"De quelle(s) maladie(s) ou difficulté(s) s’agit-il ? Diabète","T2_SANTEQ02M_C","A09R_T2_SANTEQ02M_C",null,68,"donnée","dico",null,"E9AREF_COCHE",null,null,"","","","","","","",null,"SANTÉ DE L’ENFANT"]
[null,null,null,"De quelle(s) maladie(s) ou difficulté(s) s’agit-il ? Cancer","T2_SANTEQ02M_D","A09R_T2_SANTEQ02M_D",null,69,"donnée","dico",null,"E9AREF_COCHE",null,null,"","","","","","","",null,"SANTÉ DE L’ENFANT"]
[null,null,null,"De quelle(s) maladie(s) ou difficulté(s) s’agit-il ? Autres causes d’immunodépression (corticoïdes au long cours, …)","T2_SANTEQ02M_E","A09R_T2_SANTEQ02M_E",null,70,"donnée","dico",null,"E9AREF_COCHE",null,null,"","","","","","","",null,"SANTÉ DE L’ENFANT"]
[null,null,null,"De quelle(s) maladie(s) ou difficulté(s) s’agit-il ? Retard de croissance (traité par hormone de croissance)","T2_SANTEQ02M_F","A09R_T2_SANTEQ02M_F",null,71,"donnée","dico",null,"E9AREF_COCHE",null,null,"","","","","","","",null,"SANTÉ DE L’ENFANT"]
[null,null,null,"De quelle(s) maladie(s) ou difficulté(s) s’agit-il ? Troubles du comportement (autisme, hyperactivité, anxiété, syndrome dépressif)","T2_SANTEQ02M_G","A09R_T2_SANTEQ02M_G",null,72,"donnée","dico",null,"E9AREF_COCHE",null,null,"","","","","","","",null,"SANTÉ DE L’ENFANT"]
[null,null,null,"De quelle(s) maladie(s) ou difficulté(s) s’agit-il ? Difficultés dans le développement neurologique (paralysie cérébrale, retard psychomoteur, retard de langage, dyslexie, autres troubles dys, troubles des apprentissages)","T2_SANTEQ02M_H","A09R_T2_SANTEQ02M_H",null,73,"donnée","dico",null,"E9AREF_COCHE",null,null,"","","","","","","",null,"SANTÉ DE L’ENFANT"]
[null,null,null,"De quelle(s) maladie(s) ou difficulté(s) s’agit-il ? Autre(s)","T2_SANTEQ02M_I","A09R_T2_SANTEQ02M_I",null,74,"donnée","dico",null,"E9AREF_COCHE",null,null,"","","","","","","",null,"SANTÉ DE L’ENFANT"]
[null,null,null,"Votre enfant a-t-il déjà été testé pour le coronavirus ?","T2_TESTCOQ01","A09R_T2_TESTCOQ01",null,75,"donnée","dico",null,"E9AREF_TEST1F",null,null,"","","","","","","",null,"SANTÉ DE L’ENFANT"]
[null,null,null,"Quel est le résultat de son test  ?","T2_TESTCOQ02","A09R_T2_TESTCOQ02",null,76,"donnée","dico",null,"E9AREF_TEST2F",null,null,"","","","","","","",null,"SANTÉ DE L’ENFANT"]
[null,null,null,"Quelle était la date du prélèvement pour ce test ? (Jour)","T2_TESTCOQ03J","A09R_T2_TESTCOQ03J",null,77,"donnée","dico",null,"",null,null,"","","","","","","",null,"SANTÉ DE L’ENFANT"]
[null,null,null,"Quelle était la date du prélèvement pour ce test ? (Mois)","T2_TESTCOQ03M","A09R_T2_TESTCOQ03M",null,78,"donnée","dico",null,"",null,null,"","","","","","","",null,"SANTÉ DE L’ENFANT"]
[null,null,null,"Quelle était la date du prélèvement pour ce test ? (Année)","T2_TESTCOQ03A","A09R_T2_TESTCOQ03A",null,79,"donnée","dico",null,"",null,null,"","","","","","","",null,"SANTÉ DE L’ENFANT"]
[null,null,null,"Concernant les résultats de ces tests :","T2_TESTCOQ04","A09R_T2_TESTCOQ04",null,80,"donnée","dico",null,"E9AREF_TEST3F",null,null,"","","","","","","",null,"SANTÉ DE L’ENFANT"]
[null,null,null,"Quelle était la date du prélèvement pour le premier test positif ? (Jour)","T2_TESTCOQ05J","A09R_T2_TESTCOQ05J",null,81,"donnée","dico",null,"",null,null,"","","","","","","",null,"SANTÉ DE L’ENFANT"]
[null,null,null,"Quelle était la date du prélèvement pour le premier test positif ? (Mois)","T2_TESTCOQ05M","A09R_T2_TESTCOQ05M",null,82,"donnée","dico",null,"",null,null,"","","","","","","",null,"SANTÉ DE L’ENFANT"]
[null,null,null,"Quelle était la date du prélèvement pour le premier test positif ? (Année)","T2_TESTCOQ05A","A09R_T2_TESTCOQ05A",null,83,"donnée","dico",null,"",null,null,"","","","","","","",null,"SANTÉ DE L’ENFANT"]
[null,null,null,"Quelle était la date du prélèvement pour le dernier test ? (Jour)","T2_TESTCOQ06J","A09R_T2_TESTCOQ06J",null,84,"donnée","dico",null,"",null,null,"","","","","","","",null,"SANTÉ DE L’ENFANT"]
[null,null,null,"Quelle était la date du prélèvement pour le dernier test ? (Mois)","T2_TESTCOQ06M","A09R_T2_TESTCOQ06M",null,85,"donnée","dico",null,"",null,null,"","","","","","","",null,"SANTÉ DE L’ENFANT"]
[null,null,null,"Quelle était la date du prélèvement pour le dernier test ? (Année)","T2_TESTCOQ06A","A09R_T2_TESTCOQ06A",null,86,"donnée","dico",null,"",null,null,"","","","","","","",null,"SANTÉ DE L’ENFANT"]
[null,null,null,"Depuis le début de l’année un médecin vous a-t-il dit que votre enfant avait eu le coronavirus ?","T2_TESTCOQ07","A09R_T2_TESTCOQ07",null,87,"donnée","dico",null,"E9AREF_YORN_NSP_F",null,null,"","","","","","","",null,"SANTÉ DE L’ENFANT"]
[null,null,null,"Si oui, ce diagnostic a eu lieu :","T2_TESTCOQ08","A09R_T2_TESTCOQ08",null,88,"donnée","dico",null,"E9AREF_TEST4F",null,null,"","","","","","","",null,"SANTÉ DE L’ENFANT"]
[null,null,null,"Depuis le début de l’année, en dehors de votre enfant né en 2011,  un médecin a -t- il dit à au moins une personne habitant votre logement, qu’elle avait le coronavirus ?","T2_TESTCOQ09","A09R_T2_TESTCOQ09",null,89,"donnée","dico",null,"E9AREF_YORN_NSP_F",null,null,"","","","","","","",null,"SANTÉ DE L’ENFANT"]
[null,null,null,"Pour la première personne diagnostiquée cela a eu lieu:","T2_TESTCOQ10","A09R_T2_TESTCOQ10",null,90,"donnée","dico",null,"E9AREF_TEST4F",null,null,"","","","","","","",null,"SANTÉ DE L’ENFANT"]
[null,null,null,"Au cours des 15 derniers jours, en dehors de votre enfant né en 2011, au moins une personne habitant votre logement, y compris vous-même a-t-elle présenté de la toux ou de la fièvre ?","T2_SANTEQ07","A09R_T2_SANTEQ07",null,91,"donnée","dico",null,"E9AREF_YORN",null,null,"","","","","","","",null,"SANTÉ DE L’ENFANT"]
[null,null,null,"Au cours des 15 derniers jours, en dehors de votre enfant né en 2011, au moins une personne habitant votre logement, y compris vous-même a-t-elle été testée positive au coronavirus ?","T2_SANTEQ08","A09R_T2_SANTEQ08",null,92,"donnée","dico",null,"E9AREF_YORN",null,null,"","","","","","","",null,"SANTÉ DE L’ENFANT"]
[null,null,null,"Vous-même, êtes-vous concerné.e par ces symptômes ou cette infection ?","T2_SANTEQ08A","A09R_T2_SANTEQ08A",null,93,"donnée","dico",null,"E9AREF_YORN",null,null,"","","","","","","",null,"SANTÉ DE L’ENFANT"]
[null,null,null,"Comment-allez-vous aujourd’hui ?","T2_SANTEQ08B","A09R_T2_SANTEQ08B",null,94,"donnée","dico",null,"E9AREF_SANTE4F",null,null,"","","","","","","",null,"SANTÉ DE L’ENFANT"]
[null,null,null,"D’autres personnes habitant dans votre logement sont-elles concernées par ces symptômes ou cette infection ?","T2_SANTEQ08ABIS","A09R_T2_SANTEQ08ABIS",null,95,"donnée","dico",null,"E9AREF_SANTE31F",null,null,"","","","","","","",null,"SANTÉ DE L’ENFANT"]
[null,null,null,"Quelle(s) personne(s) est ou sont concernée(s) ? Votre conjoint.e","T2_SANTEQ08M_A","A09R_T2_SANTEQ08M_A",null,96,"donnée","dico",null,"E9AREF_COCHE",null,null,"","","","","","","",null,"SANTÉ DE L’ENFANT"]
[null,null,null,"Quelle(s) personne(s) est ou sont concernée(s) ? Frère/demi-frère, sœur/demi-sœur de l’enfant Elfe","T2_SANTEQ08M_B","A09R_T2_SANTEQ08M_B",null,97,"donnée","dico",null,"E9AREF_COCHE",null,null,"","","","","","","",null,"SANTÉ DE L’ENFANT"]
[null,null,null,"Quelle(s) personne(s) est ou sont concernée(s) ? Autre personne","T2_SANTEQ08M_C","A09R_T2_SANTEQ08M_C",null,98,"donnée","dico",null,"E9AREF_COCHE",null,null,"","","","","","","",null,"SANTÉ DE L’ENFANT"]
[null,null,null,"Comment cette personne va-t-elle aujourd’hui ?","T2_SANTEQ08C","A09R_T2_SANTEQ08C",null,99,"donnée","dico",null,"E9AREF_SANTE5F",null,null,"","","","","","","",null,"SANTÉ DE L’ENFANT"]
[null,null,null,"Comment ces personnes vont-elles aujourd’hui ?","T2_SANTEQ08D","A09R_T2_SANTEQ08D",null,100,"donnée","dico",null,"E9AREF_SANTE6F",null,null,"","","","","","","",null,"SANTÉ DE L’ENFANT"]
[null,null,null,"Revenons à votre enfant né en 2011. Au cours des 15 derniers jours, y compris aujourd’hui, a-t-il présenté le symptôme suivant qu’il n’a pas habituellement? Fièvre ou sensation de fièvre","T2_SANTEQ09_S01","A09R_T2_SANTEQ09_S01",null,101,"donnée","dico",null,"E9AREF_YORN",null,null,"","","","","","","",null,"SANTÉ DE L’ENFANT"]
[null,null,null,"Le symptôme est-il encore présent aujourd’hui ? Fièvre ou sensation de fièvre","T2_SANTEQ09_S01O","A09R_T2_SANTEQ09_S01O",null,102,"donnée","dico",null,"E9AREF_YORN",null,null,"","","","","","","",null,"SANTÉ DE L’ENFANT"]
[null,null,null,"Combien de temps environ a duré ce symptôme ? Fièvre ou sensation de fièvre","T2_SANTEQ09_S01N","A09R_T2_SANTEQ09_S01N",null,103,"donnée","dico",null,"E9AREF_SANTE7F",null,null,"","","","","","","",null,"SANTÉ DE L’ENFANT"]
[null,null,null,"Revenons à votre enfant né en 2011. Au cours des 15 derniers jours, y compris aujourd’hui, a-t-il présenté le symptôme suivant qu’il n’a pas habituellement? Mal à la tête","T2_SANTEQ09_S02","A09R_T2_SANTEQ09_S02",null,104,"donnée","dico",null,"E9AREF_YORN",null,null,"","","","","","","",null,"SANTÉ DE L’ENFANT"]
[null,null,null,"Le symptôme est-il encore présent aujourd’hui ? Mal à la tête","T2_SANTEQ09_S02O","A09R_T2_SANTEQ09_S02O",null,105,"donnée","dico",null,"E9AREF_YORN",null,null,"","","","","","","",null,"SANTÉ DE L’ENFANT"]
[null,null,null,"Combien de temps environ a duré ce symptôme ? Mal à la tête","T2_SANTEQ09_S02N","A09R_T2_SANTEQ09_S02N",null,106,"donnée","dico",null,"E9AREF_SANTE7F",null,null,"","","","","","","",null,"SANTÉ DE L’ENFANT"]
[null,null,null,"Revenons à votre enfant né en 2011. Au cours des 15 derniers jours, y compris aujourd’hui, a-t-il présenté le symptôme suivant qu’il n’a pas habituellement? Fatigue inhabituelle","T2_SANTEQ09_S03","A09R_T2_SANTEQ09_S03",null,107,"donnée","dico",null,"E9AREF_YORN",null,null,"","","","","","","",null,"SANTÉ DE L’ENFANT"]
[null,null,null,"Le symptôme est-il encore présent aujourd’hui ? Fatigue inhabituelle","T2_SANTEQ09_S03O","A09R_T2_SANTEQ09_S03O",null,108,"donnée","dico",null,"E9AREF_YORN",null,null,"","","","","","","",null,"SANTÉ DE L’ENFANT"]
[null,null,null,"Combien de temps environ a duré ce symptôme ? Fatigue inhabituelle","T2_SANTEQ09_S03N","A09R_T2_SANTEQ09_S03N",null,109,"donnée","dico",null,"E9AREF_SANTE7F",null,null,"","","","","","","",null,"SANTÉ DE L’ENFANT"]
[null,null,null,"Revenons à votre enfant né en 2011. Au cours des 15 derniers jours, y compris aujourd’hui, a-t-il présenté le symptôme suivant qu’il n’a pas habituellement? Courbatures, douleurs musculaires","T2_SANTEQ09_S04","A09R_T2_SANTEQ09_S04",null,110,"donnée","dico",null,"E9AREF_YORN",null,null,"","","","","","","",null,"SANTÉ DE L’ENFANT"]
[null,null,null,"Le symptôme est-il encore présent aujourd’hui ? Courbatures, douleurs musculaires","T2_SANTEQ09_S04O","A09R_T2_SANTEQ09_S04O",null,111,"donnée","dico",null,"E9AREF_YORN",null,null,"","","","","","","",null,"SANTÉ DE L’ENFANT"]
[null,null,null,"Combien de temps environ a duré ce symptôme ? Courbatures, douleurs musculaires","T2_SANTEQ09_S04N","A09R_T2_SANTEQ09_S04N",null,112,"donnée","dico",null,"E9AREF_SANTE7F",null,null,"","","","","","","",null,"SANTÉ DE L’ENFANT"]
[null,null,null,"Revenons à votre enfant né en 2011. Au cours des 15 derniers jours, y compris aujourd’hui, a-t-il présenté le symptôme suivant qu’il n’a pas habituellement? Toux","T2_SANTEQ09_S05","A09R_T2_SANTEQ09_S05",null,113,"donnée","dico",null,"E9AREF_YORN",null,null,"","","","","","","",null,"SANTÉ DE L’ENFANT"]
[null,null,null,"Le symptôme est-il encore présent aujourd’hui ? Toux","T2_SANTEQ09_S05O","A09R_T2_SANTEQ09_S05O",null,114,"donnée","dico",null,"E9AREF_YORN",null,null,"","","","","","","",null,"SANTÉ DE L’ENFANT"]
[null,null,null,"Combien de temps environ a duré ce symptôme ? Toux","T2_SANTEQ09_S05N","A09R_T2_SANTEQ09_S05N",null,115,"donnée","dico",null,"E9AREF_SANTE7F",null,null,"","","","","","","",null,"SANTÉ DE L’ENFANT"]
[null,null,null,"Revenons à votre enfant né en 2011. Au cours des 15 derniers jours, y compris aujourd’hui, a-t-il présenté le symptôme suivant qu’il n’a pas habituellement? Difficultés respiratoires, essoufflement inhabituel","T2_SANTEQ09_S06","A09R_T2_SANTEQ09_S06",null,116,"donnée","dico",null,"E9AREF_YORN",null,null,"","","","","","","",null,"SANTÉ DE L’ENFANT"]
[null,null,null,"Le symptôme est-il encore présent aujourd’hui ? Difficultés respiratoires, essoufflement inhabituel","T2_SANTEQ09_S06O","A09R_T2_SANTEQ09_S06O",null,117,"donnée","dico",null,"E9AREF_YORN",null,null,"","","","","","","",null,"SANTÉ DE L’ENFANT"]
[null,null,null,"Combien de temps environ a duré ce symptôme ? Difficultés respiratoires, essoufflement inhabituel","T2_SANTEQ09_S06N","A09R_T2_SANTEQ09_S06N",null,118,"donnée","dico",null,"E9AREF_SANTE7F",null,null,"","","","","","","",null,"SANTÉ DE L’ENFANT"]
[null,null,null,"Revenons à votre enfant né en 2011. Au cours des 15 derniers jours, y compris aujourd’hui, a-t-il présenté le symptôme suivant qu’il n’a pas habituellement? Nez qui coule","T2_SANTEQ09_S07","A09R_T2_SANTEQ09_S07",null,119,"donnée","dico",null,"E9AREF_YORN",null,null,"","","","","","","",null,"SANTÉ DE L’ENFANT"]
[null,null,null,"Le symptôme est-il encore présent aujourd’hui ? Nez qui coule","T2_SANTEQ09_S07O","A09R_T2_SANTEQ09_S07O",null,120,"donnée","dico",null,"E9AREF_YORN",null,null,"","","","","","","",null,"SANTÉ DE L’ENFANT"]
[null,null,null,"Combien de temps environ a duré ce symptôme ? Nez qui coule","T2_SANTEQ09_S07N","A09R_T2_SANTEQ09_S07N",null,121,"donnée","dico",null,"E9AREF_SANTE7F",null,null,"","","","","","","",null,"SANTÉ DE L’ENFANT"]
[null,null,null,"Revenons à votre enfant né en 2011. Au cours des 15 derniers jours, y compris aujourd’hui, a-t-il présenté le symptôme suivant qu’il n’a pas habituellement? Mal à la gorge (pharyngite, angine)","T2_SANTEQ09_S071","A09R_T2_SANTEQ09_S071",null,122,"donnée","dico",null,"E9AREF_YORN",null,null,"","","","","","","",null,"SANTÉ DE L’ENFANT"]
[null,null,null,"Le symptôme est-il encore présent aujourd’hui ? Mal à la gorge (pharyngite, angine)","T2_SANTEQ09_S071O","A09R_T2_SANTEQ09_S071O",null,123,"donnée","dico",null,"E9AREF_YORN",null,null,"","","","","","","",null,"SANTÉ DE L’ENFANT"]
[null,null,null,"Combien de temps environ a duré ce symptôme ? Mal à la gorge (pharyngite, angine)","T2_SANTEQ09_S071N","A09R_T2_SANTEQ09_S071N",null,124,"donnée","dico",null,"E9AREF_SANTE7F",null,null,"","","","","","","",null,"SANTÉ DE L’ENFANT"]
[null,null,null,"Revenons à votre enfant né en 2011. Au cours des 15 derniers jours, y compris aujourd’hui, a-t-il présenté le symptôme suivant qu’il n’a pas habituellement? Conjonctivite accompagnée de fièvre","T2_SANTEQ09_S072","A09R_T2_SANTEQ09_S072",null,125,"donnée","dico",null,"E9AREF_YORN",null,null,"","","","","","","",null,"SANTÉ DE L’ENFANT"]
[null,null,null,"Le symptôme est-il encore présent aujourd’hui ? Conjonctivite accompagnée de fièvre","T2_SANTEQ09_S072O","A09R_T2_SANTEQ09_S072O",null,126,"donnée","dico",null,"E9AREF_YORN",null,null,"","","","","","","",null,"SANTÉ DE L’ENFANT"]
[null,null,null,"Combien de temps environ a duré ce symptôme ? Conjonctivite accompagnée de fièvre","T2_SANTEQ09_S072N","A09R_T2_SANTEQ09_S072N",null,127,"donnée","dico",null,"E9AREF_SANTE7F",null,null,"","","","","","","",null,"SANTÉ DE L’ENFANT"]
[null,null,null,"Revenons à votre enfant né en 2011. Au cours des 15 derniers jours, y compris aujourd’hui, a-t-il présenté le symptôme suivant qu’il n’a pas habituellement? Troubles du goût ou de l’odorat","T2_SANTEQ09_S08","A09R_T2_SANTEQ09_S08",null,128,"donnée","dico",null,"E9AREF_YORN",null,null,"","","","","","","",null,"SANTÉ DE L’ENFANT"]
[null,null,null,"Le symptôme est-il encore présent aujourd’hui ? Troubles du goût ou de l’odorat","T2_SANTEQ09_S08O","A09R_T2_SANTEQ09_S08O",null,129,"donnée","dico",null,"E9AREF_YORN",null,null,"","","","","","","",null,"SANTÉ DE L’ENFANT"]
[null,null,null,"Combien de temps environ a duré ce symptôme ? Troubles du goût ou de l’odorat","T2_SANTEQ09_S08N","A09R_T2_SANTEQ09_S08N",null,130,"donnée","dico",null,"E9AREF_SANTE7F",null,null,"","","","","","","",null,"SANTÉ DE L’ENFANT"]
[null,null,null,"Revenons à votre enfant né en 2011. Au cours des 15 derniers jours, y compris aujourd’hui, a-t-il présenté le symptôme suivant qu’il n’a pas habituellement? Mal au ventre, douleurs abdominales","T2_SANTEQ09_S081","A09R_T2_SANTEQ09_S081",null,131,"donnée","dico",null,"E9AREF_YORN",null,null,"","","","","","","",null,"SANTÉ DE L’ENFANT"]
[null,null,null,"Le symptôme est-il encore présent aujourd’hui ? Mal au ventre, douleurs abdominales","T2_SANTEQ09_S081O","A09R_T2_SANTEQ09_S081O",null,132,"donnée","dico",null,"E9AREF_YORN",null,null,"","","","","","","",null,"SANTÉ DE L’ENFANT"]
[null,null,null,"Combien de temps environ a duré ce symptôme ? Mal au ventre, douleurs abdominales","T2_SANTEQ09_S081N","A09R_T2_SANTEQ09_S081N",null,133,"donnée","dico",null,"E9AREF_SANTE7F",null,null,"","","","","","","",null,"SANTÉ DE L’ENFANT"]
[null,null,null,"Revenons à votre enfant né en 2011. Au cours des 15 derniers jours, y compris aujourd’hui, a-t-il présenté le symptôme suivant qu’il n’a pas habituellement? Nausées, vomissements","T2_SANTEQ09_S09","A09R_T2_SANTEQ09_S09",null,134,"donnée","dico",null,"E9AREF_YORN",null,null,"","","","","","","",null,"SANTÉ DE L’ENFANT"]
[null,null,null,"Le symptôme est-il encore présent aujourd’hui ? Nausées, vomissements","T2_SANTEQ09_S09O","A09R_T2_SANTEQ09_S09O",null,135,"donnée","dico",null,"E9AREF_YORN",null,null,"","","","","","","",null,"SANTÉ DE L’ENFANT"]
[null,null,null,"Combien de temps environ a duré ce symptôme ? Nausées, vomissements","T2_SANTEQ09_S09N","A09R_T2_SANTEQ09_S09N",null,136,"donnée","dico",null,"E9AREF_SANTE7F",null,null,"","","","","","","",null,"SANTÉ DE L’ENFANT"]
[null,null,null,"Revenons à votre enfant né en 2011. Au cours des 15 derniers jours, y compris aujourd’hui, a-t-il présenté le symptôme suivant qu’il n’a pas habituellement? Diarrhée","T2_SANTEQ09_S10","A09R_T2_SANTEQ09_S10",null,137,"donnée","dico",null,"E9AREF_YORN",null,null,"","","","","","","",null,"SANTÉ DE L’ENFANT"]
[null,null,null,"Le symptôme est-il encore présent aujourd’hui ? Diarrhée","T2_SANTEQ09_S10O","A09R_T2_SANTEQ09_S10O",null,138,"donnée","dico",null,"E9AREF_YORN",null,null,"","","","","","","",null,"SANTÉ DE L’ENFANT"]
[null,null,null,"Combien de temps environ a duré ce symptôme ? Diarrhée","T2_SANTEQ09_S10N","A09R_T2_SANTEQ09_S10N",null,139,"donnée","dico",null,"E9AREF_SANTE7F",null,null,"","","","","","","",null,"SANTÉ DE L’ENFANT"]
[null,null,null,"Revenons à votre enfant né en 2011. Au cours des 15 derniers jours, y compris aujourd’hui, a-t-il présenté le symptôme suivant qu’il n’a pas habituellement? Douleurs thoraciques, oppression","T2_SANTEQ09_S11","A09R_T2_SANTEQ09_S11",null,140,"donnée","dico",null,"E9AREF_YORN",null,null,"","","","","","","",null,"SANTÉ DE L’ENFANT"]
[null,null,null,"Le symptôme est-il encore présent aujourd’hui ? Douleurs thoraciques, oppression","T2_SANTEQ09_S11O","A09R_T2_SANTEQ09_S11O",null,141,"donnée","dico",null,"E9AREF_YORN",null,null,"","","","","","","",null,"SANTÉ DE L’ENFANT"]
[null,null,null,"Combien de temps environ a duré ce symptôme ? Douleurs thoraciques, oppression","T2_SANTEQ09_S11N","A09R_T2_SANTEQ09_S11N",null,142,"donnée","dico",null,"E9AREF_SANTE7F",null,null,"","","","","","","",null,"SANTÉ DE L’ENFANT"]
[null,null,null,"Revenons à votre enfant né en 2011. Au cours des 15 derniers jours, y compris aujourd’hui, a-t-il présenté le symptôme suivant qu’il n’a pas habituellement? Apparition de rougeurs, engelures, plaques persistantes sur les mains, les pieds ou le visage","T2_SANTEQ09_S12","A09R_T2_SANTEQ09_S12",null,143,"donnée","dico",null,"E9AREF_YORN",null,null,"","","","","","","",null,"SANTÉ DE L’ENFANT"]
[null,null,null,"Le symptôme est-il encore présent aujourd’hui ? Apparition de rougeurs, engelures, plaques persistantes sur les mains, les pieds ou le visage","T2_SANTEQ09_S12O","A09R_T2_SANTEQ09_S12O",null,144,"donnée","dico",null,"E9AREF_YORN",null,null,"","","","","","","",null,"SANTÉ DE L’ENFANT"]
[null,null,null,"Combien de temps environ a duré ce symptôme ? Apparition de rougeurs, engelures, plaques persistantes sur les mains, les pieds ou le visage","T2_SANTEQ09_S12N","A09R_T2_SANTEQ09_S12N",null,145,"donnée","dico",null,"E9AREF_SANTE7F",null,null,"","","","","","","",null,"SANTÉ DE L’ENFANT"]
[null,null,null,"Si votre enfant a ressenti au moins l’un de ces symptômes, depuis combien de jours le premier de ces symptômes est il apparu (le premier de ces symptômes a pu commencer il y a plus de 15 jours et peut ne plus être présent aujourd’hui) ?","T2_SANTEQ10","A09R_T2_SANTEQ10",null,146,"donnée","dico",null,"",null,null,"","","","","","","",null,"SANTÉ DE L’ENFANT"]
[null,null,null,"Ces symptômes vous ont-ils fait penser que votre enfant avait peut-être le coronavirus ?","T2_SANTEQ11","A09R_T2_SANTEQ11",null,147,"donnée","dico",null,"E9AREF_YORN",null,null,"","","","","","","",null,"SANTÉ DE L’ENFANT"]
[null,null,null,"Au moment de l’apparition des premiers symptômes, qu’avez-vous fait en premier ?","T2_SANTEQ12","A09R_T2_SANTEQ12",null,148,"donnée","dico",null,"E9AREF_SANTE8F",null,null,"","","","","","","",null,"SANTÉ DE L’ENFANT"]
[null,null,null,"Pour quelle raison n’avez-vous rien fait?","T2_SANTEQ38","A09R_T2_SANTEQ38",null,149,"donnée","dico",null,"E9AREF_SANTE19F",null,null,"","","","","","","",null,"SANTÉ DE L’ENFANT"]
[null,null,null,"Avez-vous réussi à joindre ou voir un professionnel de santé ?","T2_SANTEQ13","A09R_T2_SANTEQ13",null,150,"donnée","dico",null,"E9AREF_SANTE9F",null,null,"","","","","","","",null,"SANTÉ DE L’ENFANT"]
[null,null,null,"Au cours des 15 derniers jours, combien votre enfant a eu de consultations avec un médecin hors de l’hôpital (par téléphone, par vidéo, à domicile, à son cabinet)  pour ce(s) symptôme(s) ?","T2_SANTEQ14","A09R_T2_SANTEQ14",null,151,"donnée","dico",null,"E9AREF_SANTE10F",null,null,"","","","","","","",null,"SANTÉ DE L’ENFANT"]
[null,null,null,"La première consultation de votre enfant pour ce(s) symptôme(s) , a eu lieu il y a combien de jours ?","T2_SANTEQ15","A09R_T2_SANTEQ15",null,152,"donnée","dico",null,"",null,null,"","","","","","","",null,"SANTÉ DE L’ENFANT"]
[null,null,null,"Au cours des 15 derniers jours, votre enfant a-t-il eu une ou plusieurs consultations avec un médecin de l’hôpital (urgences, consultations dans l'hôpital, téléconsultation) pour ce(s) symptôme(s) ?","T2_SANTEQ16","A09R_T2_SANTEQ16",null,153,"donnée","dico",null,"E9AREF_SANTE10F",null,null,"","","","","","","",null,"SANTÉ DE L’ENFANT"]
[null,null,null,"La première consultation de votre enfant pour ce(s) symptôme(s) à l'hôpital, a eu lieu il y a combien de jours ?","T2_SANTEQ17","A09R_T2_SANTEQ17",null,154,"donnée","dico",null,"",null,null,"","","","","","","",null,"SANTÉ DE L’ENFANT"]
[null,null,null,"Au cours des 15 derniers jours, votre enfant a-t-il été hospitalisé au moins une fois pour ce(s) symptôme(s) ?","T2_SANTEQ18","A09R_T2_SANTEQ18",null,155,"donnée","dico",null,"E9AREF_SANTE11F",null,null,"","","","","","","",null,"SANTÉ DE L’ENFANT"]
[null,null,null,"Votre enfant est entré à l'hôpital il y a combien de jours (la première fois qu’il a été hospitalisé) ?","T2_SANTEQ19","A09R_T2_SANTEQ19",null,156,"donnée","dico",null,"",null,null,"","","","","","","",null,"SANTÉ DE L’ENFANT"]
[null,null,null,"Comment votre enfant va-t-il à présent ?","T2_SANTEQ19A","A09R_T2_SANTEQ19A",null,157,"donnée","dico",null,"E9AREF_SANTE12F",null,null,"","","","","","","",null,"SANTÉ DE L’ENFANT"]
[null,null,null,"Au cours des 15 derniers jours, avez-vous appelé le centre 15 ou les pompiers pour ce(s) symptôme(s) chez votre enfant?","T2_SANTEQ20","A09R_T2_SANTEQ20",null,158,"donnée","dico",null,"E9AREF_YORN",null,null,"","","","","","","",null,"SANTÉ DE L’ENFANT"]
[null,null,null,"Vous a-t-on orienté.e vers un service de suivi médical en ligne (application mobile ou site internet) ?","T2_SANTEQ21","A09R_T2_SANTEQ21",null,159,"donnée","dico",null,"E9AREF_SANTE13F",null,null,"","","","","","","",null,"SANTÉ DE L’ENFANT"]
[null,null,null,"Lors de la consultation, le médecin a-t-il :","T2_SANTEQ22","A09R_T2_SANTEQ22",null,160,"donnée","dico",null,"E9AREF_SANTE14F",null,null,"","","","","","","",null,"SANTÉ DE L’ENFANT"]
[null,null,null,"Lors de la consultation, le médecin a-t-il prescrit un test pour le coronavirus à votre enfant ?","T2_SANTEQ23","A09R_T2_SANTEQ23",null,161,"donnée","dico",null,"E9AREF_SANTE32F",null,null,"","","","","","","",null,"SANTÉ DE L’ENFANT"]
[null,null,null,"Le médecin a dit :","T2_SANTEQ24","A09R_T2_SANTEQ24",null,162,"donnée","dico",null,"E9AREF_SANTE15F",null,null,"","","","","","","",null,"SANTÉ DE L’ENFANT"]
[null,null,null,"A-t-il prescrit un traitement à votre enfant ? Oui, pour ces symptômes","T2_SANTEQ25M_A","A09R_T2_SANTEQ25M_A",null,163,"donnée","dico",null,"E9AREF_COCHE",null,null,"","","","","","","",null,"SANTÉ DE L’ENFANT"]
[null,null,null,"A-t-il prescrit un traitement à votre enfant ? Oui, pour d’autres problèmes de santé","T2_SANTEQ25M_B","A09R_T2_SANTEQ25M_B",null,164,"donnée","dico",null,"E9AREF_COCHE",null,null,"","","","","","","",null,"SANTÉ DE L’ENFANT"]
[null,null,null,"A-t-il prescrit un traitement à votre enfant ? Non","T2_SANTEQ25M_C","A09R_T2_SANTEQ25M_C",null,165,"donnée","dico",null,"E9AREF_COCHE",null,null,"","","","","","","",null,"SANTÉ DE L’ENFANT"]
[null,null,null,"A-t-il simplement recommandé que votre enfant reste chez vous et de faire tomber sa fièvre ou de surveiller l’évolution de ces symptômes ?","T2_SANTEQ26","A09R_T2_SANTEQ26",null,166,"donnée","dico",null,"E9AREF_YORN",null,null,"","","","","","","",null,"SANTÉ DE L’ENFANT"]
[null,null,null,"A-t-il conseillé d’aller à l’hôpital ou aux urgences ou a-t-il directement contacté l’hôpital pour ce(s) symptôme(s) chez votre enfant ?","T2_SANTEQ27","A09R_T2_SANTEQ27",null,167,"donnée","dico",null,"E9AREF_SANTE17F",null,null,"","","","","","","",null,"SANTÉ DE L’ENFANT"]
[null,null,null,"Le médecin vous a-t-il conseillé d’appeler le centre 15 ou a-t-il directement contacté le centre 15 pour ce(s) symptôme(s) chez votre enfant ?","T2_SANTEQ28","A09R_T2_SANTEQ28",null,168,"donnée","dico",null,"E9AREF_YORN",null,null,"","","","","","","",null,"SANTÉ DE L’ENFANT"]
[null,null,null,"A-t-il prescrit ou donné des masques pour votre enfant ?","T2_SANTEQ29","A09R_T2_SANTEQ29",null,169,"donnée","dico",null,"E9AREF_YORN",null,null,"","","","","","","",null,"SANTÉ DE L’ENFANT"]
[null,null,null,"Lors de votre premier appel au centre 15 (ou 18), a-t-on prescrit un test de détection du coronavirus à votre enfant ?","T2_SANTEQ30","A09R_T2_SANTEQ30",null,170,"donnée","dico",null,"E9AREF_SANTE32F",null,null,"","","","","","","",null,"SANTÉ DE L’ENFANT"]
[null,null,null,"Vous a-t-on dit :","T2_SANTEQ31","A09R_T2_SANTEQ31",null,171,"donnée","dico",null,"E9AREF_SANTE18F",null,null,"","","","","","","",null,"SANTÉ DE L’ENFANT"]
[null,null,null,"A-t-on simplement recommandé que votre enfant reste à domicile et de faire tomber sa fièvre ou de surveiller l’évolution de ces symptômes ?","T2_SANTEQ32","A09R_T2_SANTEQ32",null,172,"donnée","dico",null,"E9AREF_YORN",null,null,"","","","","","","",null,"SANTÉ DE L’ENFANT"]
[null,null,null,"Toujours lors de votre premier appel au centre 15 ou aux pompiers, a-t-on conseillé d’aller voir un médecin pour votre enfant ?","T2_SANTEQ33","A09R_T2_SANTEQ33",null,173,"donnée","dico",null,"E9AREF_YORN",null,null,"","","","","","","",null,"SANTÉ DE L’ENFANT"]
[null,null,null,"A-t-on conseillé d’aller à l’hôpital, aux urgences pour votre enfant?","T2_SANTEQ34","A09R_T2_SANTEQ34",null,174,"donnée","dico",null,"E9AREF_YORN",null,null,"","","","","","","",null,"SANTÉ DE L’ENFANT"]
[null,null,null,"Une équipe médicale s’est-elle rendue à votre domicile pour votre enfant ?","T2_SANTEQ35","A09R_T2_SANTEQ35",null,175,"donnée","dico",null,"E9AREF_YORN",null,null,"","","","","","","",null,"SANTÉ DE L’ENFANT"]
[null,null,null,"A-t-on prescrit un confinement dans le logement sans aucune sortie à votre enfant ?","T2_SANTEQ36","A09R_T2_SANTEQ36",null,176,"donnée","dico",null,"E9AREF_YORN",null,null,"","","","","","","",null,"SANTÉ DE L’ENFANT"]
[null,null,null,"A-t-on prescrit un confinement sans aucune sortie pour les autres personnes partageant le même logement ?","T2_SANTEQ37","A09R_T2_SANTEQ37",null,177,"donnée","dico",null,"E9AREF_YORN",null,null,"","","","","","","",null,"SANTÉ DE L’ENFANT"]
[null,null,null,"Avez-vous pris des mesures particulières depuis le début de ces symptômes ? Votre enfant est resté strictement confiné dans votre logement sans aucune sortie","T2_SANTEQ39M_A","A09R_T2_SANTEQ39M_A",null,178,"donnée","dico",null,"E9AREF_COCHE",null,null,"","","","","","","",null,"SANTÉ DE L’ENFANT"]
[null,null,null,"Avez-vous pris des mesures particulières depuis le début de ces symptômes ? Votre enfant a porté un masque lors de ses sorties à l’extérieur","T2_SANTEQ39M_B","A09R_T2_SANTEQ39M_B",null,179,"donnée","dico",null,"E9AREF_COCHE",null,null,"","","","","","","",null,"SANTÉ DE L’ENFANT"]
[null,null,null,"Avez-vous pris des mesures particulières depuis le début de ces symptômes ? Votre enfant a porté un masque dans le logement","T2_SANTEQ39M_C","A09R_T2_SANTEQ39M_C",null,180,"donnée","dico",null,"E9AREF_COCHE",null,null,"","","","","","","",null,"SANTÉ DE L’ENFANT"]
[null,null,null,"Avez-vous pris des mesures particulières depuis le début de ces symptômes ? Votre enfant s’est lavé les mains plus souvent","T2_SANTEQ39M_D","A09R_T2_SANTEQ39M_D",null,181,"donnée","dico",null,"E9AREF_COCHE",null,null,"","","","","","","",null,"SANTÉ DE L’ENFANT"]
[null,null,null,"Avez-vous pris des mesures particulières depuis le début de ces symptômes ? Vous avez isolé votre enfant des autres personnes qui partagent votre logement (par exemple, il a dormi seul ce qui n’est pas le cas habituellement)","T2_SANTEQ39M_E","A09R_T2_SANTEQ39M_E",null,182,"donnée","dico",null,"E9AREF_COCHE",null,null,"","","","","","","",null,"SANTÉ DE L’ENFANT"]
[null,null,null,"Avez-vous pris des mesures particulières depuis le début de ces symptômes ? Toutes les personnes du logement ont surveillé leur température régulièrement","T2_SANTEQ39M_F","A09R_T2_SANTEQ39M_F",null,183,"donnée","dico",null,"E9AREF_COCHE",null,null,"","","","","","","",null,"SANTÉ DE L’ENFANT"]
[null,null,null,"Avez-vous pris des mesures particulières depuis le début de ces symptômes ? Toutes les personnes du logement sont restées strictement confinées sans aucune sortie à l’extérieur","T2_SANTEQ39M_G","A09R_T2_SANTEQ39M_G",null,184,"donnée","dico",null,"E9AREF_COCHE",null,null,"","","","","","","",null,"SANTÉ DE L’ENFANT"]
[null,null,null,"Avez-vous pris des mesures particulières depuis le début de ces symptômes ? Vous navez pris aucune mesure","T2_SANTEQ39M_H","A09R_T2_SANTEQ39M_H",null,185,"donnée","dico",null,"E9AREF_COCHE",null,null,"","","","","","","",null,"SANTÉ DE L’ENFANT"]
[null,null,null,"Les personnes du logement ont porté un masque","T2_SANTEQ39M1","A09R_T2_SANTEQ39M1",null,186,"donnée","dico",null,"E9AREF_SANTE21F",null,null,"","","","","","","",null,"SANTÉ DE L’ENFANT"]
[null,null,null,"Au cours des 15 derniers jours, votre enfant a-t-il eu un besoin de consulter un professionnel de santé pour un ou plusieurs problèmes de santé non liés au coronavirus ?","T2_SANTEQ40","A09R_T2_SANTEQ40",null,187,"donnée","dico",null,"E9AREF_YORN",null,null,"","","","","","","",null,"SANTÉ DE L’ENFANT"]
[null,null,null,"Précisez :","T2_SANTEQ40P","A09R_T2_SANTEQ40P",null,188,"non-disponible","text",null,"",null,null,"","","","","","","",null,"SANTÉ DE L’ENFANT"]
[null,null,null,"Pour quelle(s) raison(s) ? - rep 1","T2_SANTEQ40M_1","A09R_T2_SANTEQ40M_1",null,483,"donnée","dico",null,"E9AREF_SANTE40M",null,null,"","","","","","","",null,"SANTÉ DE L’ENFANT"]
[null,null,null,"Pour quelle(s) raison(s) ? - rep 2","T2_SANTEQ40M_2","A09R_T2_SANTEQ40M_2",null,484,"donnée","dico",null,"E9AREF_SANTE40M",null,null,"","","","","","","",null,"SANTÉ DE L’ENFANT"]
[null,null,null,"Pour quelle(s) raison(s) ? - rep 3","T2_SANTEQ40M_3","A09R_T2_SANTEQ40M_3",null,485,"donnée","dico",null,"E9AREF_SANTE40M",null,null,"","","","","","","",null,"SANTÉ DE L’ENFANT"]
[null,null,null,"Au moment de ce(s) problème(s) de santé chez votre enfant qu’avez-vous fait ? Vous avez appelé un médecin","T2_SANTEQ41M_A","A09R_T2_SANTEQ41M_A",null,189,"donnée","dico",null,"E9AREF_COCHE",null,null,"","","","","","","",null,"SANTÉ DE L’ENFANT"]
[null,null,null,"Au moment de ce(s) problème(s) de santé chez votre enfant qu’avez-vous fait ? Vous êtes allé.e directement au cabinet d’un médecin pour votre enfant","T2_SANTEQ41M_B","A09R_T2_SANTEQ41M_B",null,190,"donnée","dico",null,"E9AREF_COCHE",null,null,"","","","","","","",null,"SANTÉ DE L’ENFANT"]
[null,null,null,"Au moment de ce(s) problème(s) de santé chez votre enfant qu’avez-vous fait ? Vous avez appelé le centre 15","T2_SANTEQ41M_C","A09R_T2_SANTEQ41M_C",null,191,"donnée","dico",null,"E9AREF_COCHE",null,null,"","","","","","","",null,"SANTÉ DE L’ENFANT"]
[null,null,null,"Au moment de ce(s) problème(s) de santé chez votre enfant qu’avez-vous fait ? Vous avez appelé les pompiers (18)","T2_SANTEQ41M_D","A09R_T2_SANTEQ41M_D",null,192,"donnée","dico",null,"E9AREF_COCHE",null,null,"","","","","","","",null,"SANTÉ DE L’ENFANT"]
[null,null,null,"Au moment de ce(s) problème(s) de santé chez votre enfant qu’avez-vous fait ? Vous êtes allé.e à l’hôpital, aux urgences pour votre enfant","T2_SANTEQ41M_E","A09R_T2_SANTEQ41M_E",null,193,"donnée","dico",null,"E9AREF_COCHE",null,null,"","","","","","","",null,"SANTÉ DE L’ENFANT"]
[null,null,null,"Au moment de ce(s) problème(s) de santé chez votre enfant qu’avez-vous fait ? Vous êtes allé.e à la pharmacie","T2_SANTEQ41M_F","A09R_T2_SANTEQ41M_F",null,194,"donnée","dico",null,"E9AREF_COCHE",null,null,"","","","","","","",null,"SANTÉ DE L’ENFANT"]
[null,null,null,"Au moment de ce(s) problème(s) de santé chez votre enfant qu’avez-vous fait ? Vous n’avez rien fait","T2_SANTEQ41M_G","A09R_T2_SANTEQ41M_G",null,195,"donnée","dico",null,"E9AREF_COCHE",null,null,"","","","","","","",null,"SANTÉ DE L’ENFANT"]
[null,null,null,"Au moment de ce(s) problème(s) de santé chez votre enfant qu’avez-vous fait ? Ce n’est pas vous qui vous êtes occupé.e de l’enfant","T2_SANTEQ41M_H","A09R_T2_SANTEQ41M_H",null,196,"donnée","dico",null,"E9AREF_COCHE",null,null,"","","","","","","",null,"SANTÉ DE L’ENFANT"]
[null,null,null,"Au moment de ce(s) problème(s) de santé chez votre enfant qu’avez-vous fait ? Autre","T2_SANTEQ41M_I","A09R_T2_SANTEQ41M_I",null,197,"donnée","dico",null,"E9AREF_COCHE",null,null,"","","","","","","",null,"SANTÉ DE L’ENFANT"]
[null,null,null,"Avez-vous réussi à joindre ou voir quelqu’un pour votre enfant ?","T2_SANTEQ42","A09R_T2_SANTEQ42",null,198,"donnée","dico",null,"E9AREF_SANTE24F",null,null,"","","","","","","",null,"SANTÉ DE L’ENFANT"]
[null,null,null,"Pour quelle raison n’avez vous rien fait ?","T2_SANTEQ43","A09R_T2_SANTEQ43",null,199,"donnée","dico",null,"E9AREF_SANTE25F",null,null,"","","","","","","",null,"SANTÉ DE L’ENFANT"]
[null,null,null,"Au cours des 15 derniers jours, votre enfant a-t-il eu une ou plusieurs consultations avec un médecin hors de l’hôpital (par téléphone, par vidéo, à domicile, à son cabinet) pour ces autres problèmes de santé ?","T2_SANTEQ44","A09R_T2_SANTEQ44",null,200,"donnée","dico",null,"E9AREF_SANTE10F",null,null,"","","","","","","",null,"SANTÉ DE L’ENFANT"]
[null,null,null,"Au cours des 15 derniers jours, votre enfant a-t-il eu une ou plusieurs consultations avec un médecin de l’hôpita (urgences, consultations dans l’hôpital, consultation à distance avec un médecin de l’hôpital) pour ces autres problèmes de santé ?","T2_SANTEQ45","A09R_T2_SANTEQ45",null,201,"donnée","dico",null,"E9AREF_SANTE10F",null,null,"","","","","","","",null,"SANTÉ DE L’ENFANT"]
[null,null,null,"Au cours des 15 derniers jours, votre enfant a-t-il été au moins une fois hospitalisé pour ces autres problèmes de santé ?","T2_SANTEQ46","A09R_T2_SANTEQ46",null,202,"donnée","dico",null,"E9AREF_SANTE10F",null,null,"","","","","","","",null,"SANTÉ DE L’ENFANT"]
[null,null,null,"Dans les 15 derniers jours, pour votre enfant, avez-vous appelé le centre 15 ou les pompiers pour ces autres problèmes de santé ?","T2_SANTEQ47","A09R_T2_SANTEQ47",null,203,"donnée","dico",null,"E9AREF_YORN",null,null,"","","","","","","",null,"SANTÉ DE L’ENFANT"]
[null,null,null,"Au cours des 15 derniers jours, avez-vous pensé que votre enfant avait peut-être le coronavirus ?","T2_SANTEQ48","A09R_T2_SANTEQ48",null,204,"donnée","dico",null,"E9AREF_YORN",null,null,"","","","","","","",null,"SANTÉ DE L’ENFANT"]
[null,null,null,"Au cours des 15 derniers jours, avez-vous eu peur que votre enfant soit contaminé en allant le faire soigner ?","T2_SANTEQ49","A09R_T2_SANTEQ49",null,205,"donnée","dico",null,"E9AREF_SANTE26F",null,null,"","","","","","","",null,"SANTÉ DE L’ENFANT"]
[null,null,null,"Durant les 15 derniers jours, votre enfant a-t-il pris l’un des médicaments suivants ? Du paracétamol (doliprane, dafalgan, efferalgan)","T2_SANTEQ50M_A","A09R_T2_SANTEQ50M_A",null,206,"donnée","dico",null,"E9AREF_COCHE",null,null,"","","","","","","",null,"SANTÉ DE L’ENFANT"]
[null,null,null,"Durant les 15 derniers jours, votre enfant a-t-il pris l’un des médicaments suivants ? De l’aspirine","T2_SANTEQ50M_B","A09R_T2_SANTEQ50M_B",null,207,"donnée","dico",null,"E9AREF_COCHE",null,null,"","","","","","","",null,"SANTÉ DE L’ENFANT"]
[null,null,null,"Durant les 15 derniers jours, votre enfant a-t-il pris l’un des médicaments suivants ? Un antibiotique","T2_SANTEQ50M_C","A09R_T2_SANTEQ50M_C",null,208,"donnée","dico",null,"E9AREF_COCHE",null,null,"","","","","","","",null,"SANTÉ DE L’ENFANT"]
[null,null,null,"Durant les 15 derniers jours, votre enfant a-t-il pris l’un des médicaments suivants ? Un corticoïde (cortisone, solupred, prednisolone, cortancyl, médrol,…)","T2_SANTEQ50M_D","A09R_T2_SANTEQ50M_D",null,209,"donnée","dico",null,"E9AREF_COCHE",null,null,"","","","","","","",null,"SANTÉ DE L’ENFANT"]
[null,null,null,"Durant les 15 derniers jours, votre enfant a-t-il pris l’un des médicaments suivants ? Un autre anti-inflammatoire (ibuprofène-advil nurofen, voltarène-diclofénac, kétoprofène biprofénid, célécoxib celebrex,…)","T2_SANTEQ50M_E","A09R_T2_SANTEQ50M_E",null,210,"donnée","dico",null,"E9AREF_COCHE",null,null,"","","","","","","",null,"SANTÉ DE L’ENFANT"]
[null,null,null,"Durant les 15 derniers jours, votre enfant a-t-il pris l’un des médicaments suivants ? Un antipaludéen (chloroquine, nivaquine, hydroxychloroquine plaquénil)","T2_SANTEQ50M_F","A09R_T2_SANTEQ50M_F",null,211,"donnée","dico",null,"E9AREF_COCHE",null,null,"","","","","","","",null,"SANTÉ DE L’ENFANT"]
[null,null,null,"Durant les 15 derniers jours, votre enfant a-t-il pris l’un des médicaments suivants ? Aucun de ces médicaments","T2_SANTEQ50M_G","A09R_T2_SANTEQ50M_G",null,212,"donnée","dico",null,"E9AREF_COCHE",null,null,"","","","","","","",null,"SANTÉ DE L’ENFANT"]
[null,null,null,"Au cours des 15 derniers jours, avez-vous renoncé à des soins pour votre enfant (médecin, kiné, orthophoniste, opération, psychologue, dentiste, etc.) ?","T2_SANTEQ51","A09R_T2_SANTEQ51",null,213,"donnée","dico",null,"E9AREF_YORN",null,null,"","","","","","","",null,"SANTÉ DE L’ENFANT"]
[null,null,null,"Pour quelle(s) raison(s) ? Le rendez-vous de votre enfant a été reporté ou annulé","T2_SANTEQ52M_A","A09R_T2_SANTEQ52M_A",null,214,"donnée","dico",null,"E9AREF_COCHE",null,null,"","","","","","","",null,"SANTÉ DE L’ENFANT"]
[null,null,null,"Pour quelle(s) raison(s) ? Le professionnel de santé avait fermé son cabinet","T2_SANTEQ52M_B","A09R_T2_SANTEQ52M_B",null,215,"donnée","dico",null,"E9AREF_COCHE",null,null,"","","","","","","",null,"SANTÉ DE L’ENFANT"]
[null,null,null,"Pour quelle(s) raison(s) ? Ce n’était pas urgent","T2_SANTEQ52M_C","A09R_T2_SANTEQ52M_C",null,216,"donnée","dico",null,"E9AREF_COCHE",null,null,"","","","","","","",null,"SANTÉ DE L’ENFANT"]
[null,null,null,"Pour quelle(s) raison(s) ? Vous ne saviez pas à qui vous adresser","T2_SANTEQ52M_D","A09R_T2_SANTEQ52M_D",null,217,"donnée","dico",null,"E9AREF_COCHE",null,null,"","","","","","","",null,"SANTÉ DE L’ENFANT"]
[null,null,null,"Pour quelle(s) raison(s) ? Vous aviez peur que votre enfant attrape le coronavirus en allant se faire soigner","T2_SANTEQ52M_E","A09R_T2_SANTEQ52M_E",null,218,"donnée","dico",null,"E9AREF_COCHE",null,null,"","","","","","","",null,"SANTÉ DE L’ENFANT"]
[null,null,null,"Pour quelle(s) raison(s) ? Vous n’aviez pas les moyens financiers d’aller le faire soigner","T2_SANTEQ52M_F","A09R_T2_SANTEQ52M_F",null,219,"donnée","dico",null,"E9AREF_COCHE",null,null,"","","","","","","",null,"SANTÉ DE L’ENFANT"]
[null,null,null,"Pour quelle(s) raison(s) ? Il n’y avait pas de médecin ou de professionnel de santé à proximité","T2_SANTEQ52M_G","A09R_T2_SANTEQ52M_G",null,220,"donnée","dico",null,"E9AREF_COCHE",null,null,"","","","","","","",null,"SANTÉ DE L’ENFANT"]
[null,null,null,"Pour quelle(s) raison(s) ? Vous aviez des difficultés à trouver quelqu’un pour vous accompagner","T2_SANTEQ52M_H","A09R_T2_SANTEQ52M_H",null,221,"donnée","dico",null,"E9AREF_COCHE",null,null,"","","","","","","",null,"SANTÉ DE L’ENFANT"]
[null,null,null,"Pour quelle(s) raison(s) ? Autre","T2_SANTEQ52M_I","A09R_T2_SANTEQ52M_I",null,222,"donnée","dico",null,"E9AREF_COCHE",null,null,"","","","","","","",null,"SANTÉ DE L’ENFANT"]
[null,null,null,"Avant le confinement, votre enfant bénéficiait-il de manière régulière d’une prise en charge particulière (kiné, orthophoniste, psychologue, rééducation …)","T2_SANTEQ53","A09R_T2_SANTEQ53",null,223,"donnée","dico",null,"E9AREF_YORN",null,null,"","","","","","","",null,"SANTÉ DE L’ENFANT"]
[null,null,null,"Avez-vous pu poursuivre cette prise en charge depuis le début du confinement ?","T2_SANTEQ54","A09R_T2_SANTEQ54",null,224,"donnée","dico",null,"E9AREF_SANTE29F",null,null,"","","","","","","",null,"SANTÉ DE L’ENFANT"]
[null,null,null,"Assurez-vous vous-même cette prise en charge ?","T2_SANTEQ55","A09R_T2_SANTEQ55",null,225,"donnée","dico",null,"E9AREF_SANTE30F",null,null,"","","","","","","",null,"SANTÉ DE L’ENFANT"]
[null,null,null,"Quelle couverture médicale avez-vous actuellement pour votre enfant?","T2_SANTEQ56","A09R_T2_SANTEQ56",null,226,"donnée","dico",null,"E9AREF_SANTE33F",null,null,"","","","","","","",null,"SANTÉ DE L’ENFANT"]
[null,null,null,"Êtes-vous favorable aux vaccinations en général ?","T2_OPINIONQ20","A09R_T2_OPINIONQ20",null,227,"donnée","dico",null,"E9AREF_EPID8F",null,null,"","","","","","","",null,"SANTÉ DE L’ENFANT",null,0]
[null,null,null,"SITUATION PRINCIPALE VIS-À-VIS DU TRAVAIL",null,null,null,null,null,null,null,null,null,null,null,null,null,null,null,null,null,null,null,null,1]
[null,null,null,"Quelle est aujourd'hui votre situation vis-à-vis de l'emploi ? Étudiant.e, lycéen.ne, stagiaire, apprenti.e, etc.","T2_EMPLOIQ01M_A","A09R_T2_EMPLOIQ01M_A",null,228,"donnée","dico",null,"E9AREF_COCHE",null,null,"","","","","","","",null,"SITUATION PRINCIPALE VIS-À-VIS DU TRAVAIL"]
[null,null,null,"Quelle est aujourd'hui votre situation vis-à-vis de l'emploi ? En emploi, y compris en arrêt temporaire de travail (chômage technique ou partiel, arrêt maladie, congé sans solde ou disponibilité, congé maternité, paternité, dadoption, parental)","T2_EMPLOIQ01M_B","A09R_T2_EMPLOIQ01M_B",null,229,"donnée","dico",null,"E9AREF_COCHE",null,null,"","","","","","","",null,"SITUATION PRINCIPALE VIS-À-VIS DU TRAVAIL"]
[null,null,null,"Quelle est aujourd'hui votre situation vis-à-vis de l'emploi ? Demandeur demploi ou à la recherche dun emploi","T2_EMPLOIQ01M_C","A09R_T2_EMPLOIQ01M_C",null,230,"donnée","dico",null,"E9AREF_COCHE",null,null,"","","","","","","",null,"SITUATION PRINCIPALE VIS-À-VIS DU TRAVAIL"]
[null,null,null,"Quelle est aujourd'hui votre situation vis-à-vis de l'emploi ? Retraité.e ou retiré.e des affaires","T2_EMPLOIQ01M_D","A09R_T2_EMPLOIQ01M_D",null,231,"donnée","dico",null,"E9AREF_COCHE",null,null,"","","","","","","",null,"SITUATION PRINCIPALE VIS-À-VIS DU TRAVAIL"]
[null,null,null,"Quelle est aujourd'hui votre situation vis-à-vis de l'emploi ? Ne travaille pas pour raisons de santé (invalidité, maladie chronique, etc.)","T2_EMPLOIQ01M_E","A09R_T2_EMPLOIQ01M_E",null,232,"donnée","dico",null,"E9AREF_COCHE",null,null,"","","","","","","",null,"SITUATION PRINCIPALE VIS-À-VIS DU TRAVAIL"]
[null,null,null,"Quelle est aujourd'hui votre situation vis-à-vis de l'emploi ? Sans activité professionnelle","T2_EMPLOIQ01M_F","A09R_T2_EMPLOIQ01M_F",null,233,"donnée","dico",null,"E9AREF_COCHE",null,null,"","","","","","","",null,"SITUATION PRINCIPALE VIS-À-VIS DU TRAVAIL"]
[null,null,null,"Quelle est votre profession (ou votre dernière profession) ?","T2_EMPLOIQ01BIS","A09R_T2_EMPLOIQ01BIS",null,234,"donnée","dico",null,"E9AREF_TRAV8_T2F",null,null,"","","","","","","",null,"SITUATION PRINCIPALE VIS-À-VIS DU TRAVAIL"]
[null,null,null,"Dans cet emploi, vous êtes :","T2_EMPLOIQ02","A09R_T2_EMPLOIQ02",null,235,"donnée","dico",null,"E9AREF_TRAV2_T2F",null,null,"","","","","","","",null,"SITUATION PRINCIPALE VIS-À-VIS DU TRAVAIL"]
[null,null,null,"Quel est votre type de contrat de travail ?","T2_EMPLOIQ03","A09R_T2_EMPLOIQ03",null,236,"donnée","dico",null,"E9AREF_TRAV3_T2F",null,null,"","","","","","","",null,"SITUATION PRINCIPALE VIS-À-VIS DU TRAVAIL"]
[null,null,null,"Depuis le début du confinement, êtes-vous passé.e au chômage technique ou partiel ?","T2_EMPLOIQ04","A09R_T2_EMPLOIQ04",null,237,"donnée","dico",null,"E9AREF_TRAV4_YORN1F",null,null,"","","","","","","",null,"SITUATION PRINCIPALE VIS-À-VIS DU TRAVAIL"]
[null,null,null,"Au cours des 7 derniers jours, avez-vous exercé au moins une heure de travail rémunéré ?","T2_EMPLOIQ05","A09R_T2_EMPLOIQ05",null,238,"donnée","dico",null,"E9AREF_YORN",null,null,"","","","","","","",null,"SITUATION PRINCIPALE VIS-À-VIS DU TRAVAIL"]
[null,null,null,"Votre situation professionnelle a-t-elle changé depuis les premières mesures de confinement ?","T2_EMPLOIQ06","A09R_T2_EMPLOIQ06",null,239,"donnée","dico",null,"E9AREF_TRAV5_YORN2F",null,null,"","","","","","","",null,"SITUATION PRINCIPALE VIS-À-VIS DU TRAVAIL"]
[null,null,null,"Votre métier fait-il partie des services considérés comme essentiels dans le contexte de l’épidémie ?","T2_EMPLOIQ07","A09R_T2_EMPLOIQ07",null,240,"donnée","dico",null,"E9AREF_YORN_NSP_F",null,null,"","","","","","","",null,"SITUATION PRINCIPALE VIS-À-VIS DU TRAVAIL"]
[null,null,null,"Vous occupez un poste de :","T2_EMPLOIQ08","A09R_T2_EMPLOIQ08",null,241,"donnée","dico",null,"E9AREF_TRAV6F",null,null,"","","","","","","",null,"SITUATION PRINCIPALE VIS-À-VIS DU TRAVAIL"]
[null,null,null,"Avant les mesures de confinement, aviez-vous un travail rémunéré ?","T2_EMPLOIQ08A","A09R_T2_EMPLOIQ08A",null,242,"donnée","dico",null,"E9AREF_YORN",null,null,"","","","","","","",null,"SITUATION PRINCIPALE VIS-À-VIS DU TRAVAIL"]
[null,null,null,"Depuis le début du confinement, votre situation professionnelle a-t-elle changé ?","T2_EMPLOIQ09","A09R_T2_EMPLOIQ09",null,243,"donnée","dico",null,"E9AREF_TRAV7F",null,null,"","","","","","","",null,"SITUATION PRINCIPALE VIS-À-VIS DU TRAVAIL"]
[null,null,null,"Depuis le début du confinement, votre temps de travail a :","T2_EMPLOIQ10","A09R_T2_EMPLOIQ10",null,244,"donnée","dico",null,"E9AREF_TRAV9F",null,null,"","","","","","","",null,"SITUATION PRINCIPALE VIS-À-VIS DU TRAVAIL"]
[null,null,null,"Quelle est aujourd’hui sa situation vis-à-vis de l'emploi ? Étudiant.e, lycéen.ne, stagiaire, apprenti.e, etc.","T2_EMPLOIQ_C01M_A","A09R_T2_EMPLOIQ_C01M_A",null,245,"donnée","dico",null,"E9AREF_COCHE",null,null,"","","","","","","",null,"SITUATION PRINCIPALE VIS-À-VIS DU TRAVAIL"]
[null,null,null,"Quelle est aujourd’hui sa situation vis-à-vis de l'emploi ? En emploi, y compris en arrêt temporaire de travail (chômage technique ou partiel, arrêt maladie, congé sans solde ou disponibilité, congé maternité, paternité, dadoption, parental)","T2_EMPLOIQ_C01M_B","A09R_T2_EMPLOIQ_C01M_B",null,246,"donnée","dico",null,"E9AREF_COCHE",null,null,"","","","","","","",null,"SITUATION PRINCIPALE VIS-À-VIS DU TRAVAIL"]
[null,null,null,"Quelle est aujourd’hui sa situation vis-à-vis de l'emploi ? Demandeur demploi ou à la recherche dun emploi","T2_EMPLOIQ_C01M_C","A09R_T2_EMPLOIQ_C01M_C",null,247,"donnée","dico",null,"E9AREF_COCHE",null,null,"","","","","","","",null,"SITUATION PRINCIPALE VIS-À-VIS DU TRAVAIL"]
[null,null,null,"Quelle est aujourd’hui sa situation vis-à-vis de l'emploi ? Retraité.e ou retiré.e des affaires","T2_EMPLOIQ_C01M_D","A09R_T2_EMPLOIQ_C01M_D",null,248,"donnée","dico",null,"E9AREF_COCHE",null,null,"","","","","","","",null,"SITUATION PRINCIPALE VIS-À-VIS DU TRAVAIL"]
[null,null,null,"Quelle est aujourd’hui sa situation vis-à-vis de l'emploi ? Ne travaille pas pour raisons de santé (invalidité, maladie chronique, etc.)","T2_EMPLOIQ_C01M_E","A09R_T2_EMPLOIQ_C01M_E",null,249,"donnée","dico",null,"E9AREF_COCHE",null,null,"","","","","","","",null,"SITUATION PRINCIPALE VIS-À-VIS DU TRAVAIL"]
[null,null,null,"Quelle est aujourd’hui sa situation vis-à-vis de l'emploi ? Sans activité professionnelle","T2_EMPLOIQ_C01M_F","A09R_T2_EMPLOIQ_C01M_F",null,250,"donnée","dico",null,"E9AREF_COCHE",null,null,"","","","","","","",null,"SITUATION PRINCIPALE VIS-À-VIS DU TRAVAIL"]
[null,null,null,"Quelle est sa profession (ou sa dernière profession) ?","T2_EMPLOIQ_C01BIS","A09R_T2_EMPLOIQ_C01BIS",null,251,"donnée","dico",null,"E9AREF_TRAV8_T2F",null,null,"","","","","","","",null,"SITUATION PRINCIPALE VIS-À-VIS DU TRAVAIL"]
[null,null,null,"Dans cet emploi, est-il/elle :","T2_EMPLOIQ_C02","A09R_T2_EMPLOIQ_C02",null,252,"donnée","dico",null,"E9AREF_TRAV2ALTER",null,null,"","","","","","","",null,"SITUATION PRINCIPALE VIS-À-VIS DU TRAVAIL"]
[null,null,null,"Quel est son type de contrat de travail ?","T2_EMPLOIQ_C03","A09R_T2_EMPLOIQ_C03",null,253,"donnée","dico",null,"E9AREF_TRAV3_T2F",null,null,"","","","","","","",null,"SITUATION PRINCIPALE VIS-À-VIS DU TRAVAIL"]
[null,null,null,"Depuis le début du confinement, est-il/elle passé.e au chômage technique ou partiel ?","T2_EMPLOIQ_C04","A09R_T2_EMPLOIQ_C04",null,254,"donnée","dico",null,"E9AREF_TRAV4_YORN1F",null,null,"","","","","","","",null,"SITUATION PRINCIPALE VIS-À-VIS DU TRAVAIL"]
[null,null,null,"Au cours des 7 derniers jours, a-t-il/elle exercé au moins une heure de travail rémunéré ?","T2_EMPLOIQ_C05","A09R_T2_EMPLOIQ_C05",null,255,"donnée","dico",null,"E9AREF_YORN",null,null,"","","","","","","",null,"SITUATION PRINCIPALE VIS-À-VIS DU TRAVAIL"]
[null,null,null,"Sa situation professionnelle a-t-elle changé depuis les premières mesures de confinement ?","T2_EMPLOIQ_C06","A09R_T2_EMPLOIQ_C06",null,256,"donnée","dico",null,"E9AREF_TRAV5_YORN2ALTER",null,null,"","","","","","","",null,"SITUATION PRINCIPALE VIS-À-VIS DU TRAVAIL"]
[null,null,null,"Son métier fait-il partie des services considérés comme essentiels dans le contexte de l’épidémie ?","T2_EMPLOIQ_C07","A09R_T2_EMPLOIQ_C07",null,257,"donnée","dico",null,"E9AREF_YORN_NSP_F",null,null,"","","","","","","",null,"SITUATION PRINCIPALE VIS-À-VIS DU TRAVAIL"]
[null,null,null,"Il/elle occupe un poste de :","T2_EMPLOIQ_C08","A09R_T2_EMPLOIQ_C08",null,258,"donnée","dico",null,"E9AREF_TRAV6F",null,null,"","","","","","","",null,"SITUATION PRINCIPALE VIS-À-VIS DU TRAVAIL"]
[null,null,null,"Avant les mesures de confinement, avait-il/elle un travail rémunéré ?","T2_EMPLOIQ_C08A","A09R_T2_EMPLOIQ_C08A",null,259,"donnée","dico",null,"E9AREF_YORN",null,null,"","","","","","","",null,"SITUATION PRINCIPALE VIS-À-VIS DU TRAVAIL"]
[null,null,null,"Depuis le début du confinement, sa situation professionnelle a-t-elle changé ?","T2_EMPLOIQ_C09","A09R_T2_EMPLOIQ_C09",null,260,"donnée","dico",null,"E9AREF_TRAV7ALTER",null,null,"","","","","","","",null,"SITUATION PRINCIPALE VIS-À-VIS DU TRAVAIL"]
[null,null,null,"Depuis le début du confinement, son temps de travail a :","T2_EMPLOIQ_C10","A09R_T2_EMPLOIQ_C10",null,261,"donnée","dico",null,"E9AREF_TRAV9F",null,null,"","","","","","","",null,"SITUATION PRINCIPALE VIS-À-VIS DU TRAVAIL"]
[null,null,null,"Depuis le début du confinement, la situation financière de votre foyer a-t-elle changé ?","T2_EMPLOIQ11","A09R_T2_EMPLOIQ11",null,262,"donnée","dico",null,"E9AREF_TRAV10F",null,null,"","","","","","","",null,"SITUATION PRINCIPALE VIS-À-VIS DU TRAVAIL"]
[null,null,null,"Aujourd’hui, que diriez-vous de la situation financière de votre foyer ?","T2_EMPLOIQ12","A09R_T2_EMPLOIQ12",null,263,"donnée","dico",null,"E9AREF_TRAV11F",null,null,"","","","","","","",null,"SITUATION PRINCIPALE VIS-À-VIS DU TRAVAIL",null,0]
[null,null,null,"CONDITIONS DE VIE (BIS)",null,null,null,null,null,null,null,null,null,null,null,null,null,null,null,null,null,null,null,null,1]
[null,null,null,"Avant le confinement quel était le montant total des revenus mensuels nets de votre foyer (c’est-à-dire la somme des revenus des personnes de votre foyer quelle qu’en soit l’origine) ?","T2_REVENUQ01BIS","A09R_T2_REVENUQ01BIS",null,264,"donnée","dico",null,"E9AREF_REVENU1F",null,null,"","","","","","","",null,"CONDITIONS DE VIE (BIS)"]
[null,null,null,"Si vous vendiez tous vos biens (résidence principale, résidence secondaire, mobilier, voiture, bijoux, etc., et après remboursement de vos éventuels crédits) à quelle somme pensez-vous que cela correspondrait ?","T2_REVENUQ02BIS","A09R_T2_REVENUQ02BIS",null,265,"donnée","dico",null,"E9AREF_REVENU2F",null,null,"","","","","","","",null,"CONDITIONS DE VIE (BIS)",null,0]
[null,null,null,"ALIMENTATION",null,null,null,null,null,null,null,null,null,null,null,null,null,null,null,null,null,null,null,null,1]
[null,null,null,"Concernant l’alimentation de votre enfant en ce moment, diriez-vous qu’elle a changé (qualité, quantité, nature des produits, rythme des repas, etc.) par rapport à avant le confinement ?","T2_ALIMQ01","A09R_T2_ALIMQ01",null,266,"donnée","dico",null,"E9AREF_ALIM1F",null,null,"","","","","","","",null,"ALIMENTATION"]
[null,null,null,"Pour quelle(s) raison(s) ? Vous achetez moins de produits frais","T2_ALIMQ02M_A","A09R_T2_ALIMQ02M_A",null,267,"donnée","dico",null,"E9AREF_COCHE",null,null,"","","","","","","",null,"ALIMENTATION"]
[null,null,null,"Pour quelle(s) raison(s) ? Vous achetez plus de produits frais","T2_ALIMQ02M_B","A09R_T2_ALIMQ02M_B",null,268,"donnée","dico",null,"E9AREF_COCHE",null,null,"","","","","","","",null,"ALIMENTATION"]
[null,null,null,"Pour quelle(s) raison(s) ? Vous ne trouvez plus les aliments que vous aviez l’habitude d’acheter dans vos magasins habituels","T2_ALIMQ02M_C","A09R_T2_ALIMQ02M_C",null,269,"donnée","dico",null,"E9AREF_COCHE",null,null,"","","","","","","",null,"ALIMENTATION"]
[null,null,null,"Pour quelle(s) raison(s) ? La situation actuelle impacte vos revenus, vous économisez sur les achats alimentaires","T2_ALIMQ02M_D","A09R_T2_ALIMQ02M_D",null,270,"donnée","dico",null,"E9AREF_COCHE",null,null,"","","","","","","",null,"ALIMENTATION"]
[null,null,null,"Pour quelle(s) raison(s) ? Vous achetez des produits de meilleure qualité","T2_ALIMQ02M_E","A09R_T2_ALIMQ02M_E",null,271,"donnée","dico",null,"E9AREF_COCHE",null,null,"","","","","","","",null,"ALIMENTATION"]
[null,null,null,"Pour quelle(s) raison(s) ? Vous cuisinez davantage de repas « faits maison »","T2_ALIMQ02M_F","A09R_T2_ALIMQ02M_F",null,272,"donnée","dico",null,"E9AREF_COCHE",null,null,"","","","","","","",null,"ALIMENTATION"]
[null,null,null,"Pour quelle(s) raison(s) ? Vous prenez plus de repas en famille","T2_ALIMQ02M_G","A09R_T2_ALIMQ02M_G",null,273,"donnée","dico",null,"E9AREF_COCHE",null,null,"","","","","","","",null,"ALIMENTATION"]
[null,null,null,"Pour quelle(s) raison(s) ? Vous prenez plus de repas devant la télévision ou un autre écran","T2_ALIMQ02M_H","A09R_T2_ALIMQ02M_H",null,274,"donnée","dico",null,"E9AREF_COCHE",null,null,"","","","","","","",null,"ALIMENTATION"]
[null,null,null,"Pour quelle(s) raison(s) ? Vous avez du mal à conserver un rythme de repas familiaux réguliers","T2_ALIMQ02M_I","A09R_T2_ALIMQ02M_I",null,275,"donnée","dico",null,"E9AREF_COCHE",null,null,"","","","","","","",null,"ALIMENTATION"]
[null,null,null,"Pour quelle(s) raison(s) ? Votre enfant mangeait régulièrement hors du domicile familial (cantine, grand-parents...) et ce n’est plus le cas","T2_ALIMQ02M_J","A09R_T2_ALIMQ02M_J",null,276,"donnée","dico",null,"E9AREF_COCHE",null,null,"","","","","","","",null,"ALIMENTATION"]
[null,null,null,"Pour quelle(s) raison(s) ? Votre enfant mange davantage que d’habitude au cours des repas et du goûter","T2_ALIMQ02M_K","A09R_T2_ALIMQ02M_K",null,277,"donnée","dico",null,"E9AREF_COCHE",null,null,"","","","","","","",null,"ALIMENTATION"]
[null,null,null,"Pour quelle(s) raison(s) ? Votre enfant mange moins que d’habitude au cours des repas et du goûter","T2_ALIMQ02M_L","A09R_T2_ALIMQ02M_L",null,278,"donnée","dico",null,"E9AREF_COCHE",null,null,"","","","","","","",null,"ALIMENTATION"]
[null,null,null,"Pour quelle(s) raison(s) ? Votre enfant mange plus souvent entre les repas et le goûter","T2_ALIMQ02M_M","A09R_T2_ALIMQ02M_M",null,279,"donnée","dico",null,"E9AREF_COCHE",null,null,"","","","","","","",null,"ALIMENTATION"]
[null,null,null,"Pour quelle(s) raison(s) ? Votre enfant mange moins souvent entre les repas et le goûter","T2_ALIMQ02M_N","A09R_T2_ALIMQ02M_N",null,280,"donnée","dico",null,"E9AREF_COCHE",null,null,"","","","","","","",null,"ALIMENTATION"]
[null,null,null,"Pour quelle(s) raison(s) ? Vous avez volontairement réduit la consommation de certains aliments ou boissons pour que votre enfant ne prenne pas de poids","T2_ALIMQ02M_O","A09R_T2_ALIMQ02M_O",null,281,"donnée","dico",null,"E9AREF_COCHE",null,null,"","","","","","","",null,"ALIMENTATION"]
[null,null,null,"Au cours du mois d'avril, pour cet aliment ou groupe d'aliments : Céréales de type petit-déjeuner, quelle a été la fréquence de sa consommation que ce soit AU COURS DES REPAS OU ENTRE LES REPAS","T2_CEREAL","A09R_T2_CEREAL",null,282,"donnée","dico",null,"E9AREF_ALIM3F",null,null,"","","","","","","",null,"ALIMENTATION"]
[null,null,null,"Au cours du mois d'avril, pour cet aliment ou groupe d'aliments : Pain blanc, quelle a été la fréquence de sa consommation que ce soit AU COURS DES REPAS OU ENTRE LES REPAS","T2_PAIN7B","A09R_T2_PAIN7B",null,283,"donnée","dico",null,"E9AREF_ALIM3F",null,null,"","","","","","","",null,"ALIMENTATION"]
[null,null,null,"Au cours du mois d'avril, pour cet aliment ou groupe d'aliments : Autre pain (complet, aux céréales…), quelle a été la fréquence de sa consommation que ce soit AU COURS DES REPAS OU ENTRE LES REPAS","T2_PAIN7AUT","A09R_T2_PAIN7AUT",null,284,"donnée","dico",null,"E9AREF_ALIM3F",null,null,"","","","","","","",null,"ALIMENTATION"]
[null,null,null,"Au cours du mois d'avril, pour cet aliment ou groupe d'aliments : Lait de vache (écrémé, demi-écrémé ou entier), quelle a été la fréquence de sa consommation que ce soit AU COURS DES REPAS OU ENTRE LES REPAS","T2_LAIT","A09R_T2_LAIT",null,285,"donnée","dico",null,"E9AREF_ALIM3F",null,null,"","","","","","","",null,"ALIMENTATION"]
[null,null,null,"Au cours du mois d'avril, pour cet aliment ou groupe d'aliments : Boisson végétale à base de soja, riz, amande..., quelle a été la fréquence de sa consommation que ce soit AU COURS DES REPAS OU ENTRE LES REPAS","T2_BOISVEG","A09R_T2_BOISVEG",null,286,"donnée","dico",null,"E9AREF_ALIM3F",null,null,"","","","","","","",null,"ALIMENTATION"]
[null,null,null,"Au cours du mois d'avril, pour cet aliment ou groupe d'aliments : Laitages (yaourts, petits-suisses, fromage blanc), quelle a été la fréquence de sa consommation que ce soit AU COURS DES REPAS OU ENTRE LES REPAS","T2_LAITAGE","A09R_T2_LAITAGE",null,287,"donnée","dico",null,"E9AREF_ALIM3F",null,null,"","","","","","","",null,"ALIMENTATION"]
[null,null,null,"Au cours du mois d'avril, pour cet aliment ou groupe d'aliments : Desserts lactés (crème dessert, glace, flan…), quelle a été la fréquence de sa consommation que ce soit AU COURS DES REPAS OU ENTRE LES REPAS","T2_DESSERTLAI","A09R_T2_DESSERTLAI",null,288,"donnée","dico",null,"E9AREF_ALIM3F",null,null,"","","","","","","",null,"ALIMENTATION"]
[null,null,null,"Au cours du mois d'avril, pour cet aliment ou groupe d'aliments : Fromage, quelle a été la fréquence de sa consommation que ce soit AU COURS DES REPAS OU ENTRE LES REPAS","T2_FROM","A09R_T2_FROM",null,289,"donnée","dico",null,"E9AREF_ALIM3F",null,null,"","","","","","","",null,"ALIMENTATION"]
[null,null,null,"Au cours du mois d'avril, pour cet aliment ou groupe d'aliments : Crudités, salade, quelle a été la fréquence de sa consommation que ce soit AU COURS DES REPAS OU ENTRE LES REPAS","T2_CRUISAL","A09R_T2_CRUISAL",null,290,"donnée","dico",null,"E9AREF_ALIM3F",null,null,"","","","","","","",null,"ALIMENTATION"]
[null,null,null,"Au cours du mois d'avril, pour cet aliment ou groupe d'aliments : Légumes cuits (en dehors des pommes de terre), soupes, quelle a été la fréquence de sa consommation que ce soit AU COURS DES REPAS OU ENTRE LES REPAS","T2_LEGUMCUI","A09R_T2_LEGUMCUI",null,291,"donnée","dico",null,"E9AREF_ALIM3F",null,null,"","","","","","","",null,"ALIMENTATION"]
[null,null,null,"Au cours du mois d'avril, pour cet aliment ou groupe d'aliments : Légumes secs (lentilles, haricots blancs…), quelle a été la fréquence de sa consommation que ce soit AU COURS DES REPAS OU ENTRE LES REPAS","T2_LEGUMSEC","A09R_T2_LEGUMSEC",null,292,"donnée","dico",null,"E9AREF_ALIM3F",null,null,"","","","","","","",null,"ALIMENTATION"]
[null,null,null,"Au cours du mois d'avril, pour cet aliment ou groupe d'aliments : Pâtes, riz, semoule, quelle a été la fréquence de sa consommation que ce soit AU COURS DES REPAS OU ENTRE LES REPAS","T2_PATERISEM","A09R_T2_PATERISEM",null,293,"donnée","dico",null,"E9AREF_ALIM3F",null,null,"","","","","","","",null,"ALIMENTATION"]
[null,null,null,"Au cours du mois d'avril, pour cet aliment ou groupe d'aliments : Pommes de terre (à l’eau ou en purée), quelle a été la fréquence de sa consommation que ce soit AU COURS DES REPAS OU ENTRE LES REPAS","T2_PDT","A09R_T2_PDT",null,294,"donnée","dico",null,"E9AREF_ALIM3F",null,null,"","","","","","","",null,"ALIMENTATION"]
[null,null,null,"Au cours du mois d'avril, pour cet aliment ou groupe d'aliments : Frites, pommes de terre sautées, quelle a été la fréquence de sa consommation que ce soit AU COURS DES REPAS OU ENTRE LES REPAS","T2_PDTFRIT","A09R_T2_PDTFRIT",null,295,"donnée","dico",null,"E9AREF_ALIM3F",null,null,"","","","","","","",null,"ALIMENTATION"]
[null,null,null,"Au cours du mois d'avril, pour cet aliment ou groupe d'aliments : Quiches, pizzas, tartes salées, quelle a été la fréquence de sa consommation que ce soit AU COURS DES REPAS OU ENTRE LES REPAS","T2_TARTESAL","A09R_T2_TARTESAL",null,296,"donnée","dico",null,"E9AREF_ALIM3F",null,null,"","","","","","","",null,"ALIMENTATION"]
[null,null,null,"Au cours du mois d'avril, pour cet aliment ou groupe d'aliments : Chips, biscuits apéritifs, quelle a été la fréquence de sa consommation que ce soit AU COURS DES REPAS OU ENTRE LES REPAS","T2_BISCAPERO","A09R_T2_BISCAPERO",null,297,"donnée","dico",null,"E9AREF_ALIM3F",null,null,"","","","","","","",null,"ALIMENTATION"]
[null,null,null,"Au cours du mois d'avril, pour cet aliment ou groupe d'aliments : Volaille ou jambon, quelle a été la fréquence de sa consommation que ce soit AU COURS DES REPAS OU ENTRE LES REPAS","T2_VOLAJAM","A09R_T2_VOLAJAM",null,298,"donnée","dico",null,"E9AREF_ALIM3F",null,null,"","","","","","","",null,"ALIMENTATION"]
[null,null,null,"Au cours du mois d'avril, pour cet aliment ou groupe d'aliments : Viande type bœuf, mouton, porc, quelle a été la fréquence de sa consommation que ce soit AU COURS DES REPAS OU ENTRE LES REPAS","T2_VIAND","A09R_T2_VIAND",null,299,"donnée","dico",null,"E9AREF_ALIM3F",null,null,"","","","","","","",null,"ALIMENTATION"]
[null,null,null,"Au cours du mois d'avril, pour cet aliment ou groupe d'aliments : Charcuterie (sauf jambon), quelle a été la fréquence de sa consommation que ce soit AU COURS DES REPAS OU ENTRE LES REPAS","T2_CHARCUSJ","A09R_T2_CHARCUSJ",null,300,"donnée","dico",null,"E9AREF_ALIM3F",null,null,"","","","","","","",null,"ALIMENTATION"]
[null,null,null,"Au cours du mois d'avril, pour cet aliment ou groupe d'aliments : Œufs, quelle a été la fréquence de sa consommation que ce soit AU COURS DES REPAS OU ENTRE LES REPAS","T2_OEUF","A09R_T2_OEUF",null,301,"donnée","dico",null,"E9AREF_ALIM3F",null,null,"","","","","","","",null,"ALIMENTATION"]
[null,null,null,"Au cours du mois d'avril, pour cet aliment ou groupe d'aliments : Poisson gras type maquereau, sardines, saumon, thon, hareng, quelle a été la fréquence de sa consommation que ce soit AU COURS DES REPAS OU ENTRE LES REPAS","T2_POISGRA","A09R_T2_POISGRA",null,302,"donnée","dico",null,"E9AREF_ALIM3F",null,null,"","","","","","","",null,"ALIMENTATION"]
[null,null,null,"Au cours du mois d'avril, pour cet aliment ou groupe d'aliments : Poisson blanc non pané type cabillaud, colin, merlan, etc., quelle a été la fréquence de sa consommation que ce soit AU COURS DES REPAS OU ENTRE LES REPAS","T2_POISFRAI","A09R_T2_POISFRAI",null,303,"donnée","dico",null,"E9AREF_ALIM3F",null,null,"","","","","","","",null,"ALIMENTATION"]
[null,null,null,"Au cours du mois d'avril, pour cet aliment ou groupe d'aliments : Poisson pané, quelle a été la fréquence de sa consommation que ce soit AU COURS DES REPAS OU ENTRE LES REPAS","T2_POISPANE","A09R_T2_POISPANE",null,304,"donnée","dico",null,"E9AREF_ALIM3F",null,null,"","","","","","","",null,"ALIMENTATION"]
[null,null,null,"Au cours du mois d'avril, pour cet aliment ou groupe d'aliments : Fruits frais, quelle a été la fréquence de sa consommation que ce soit AU COURS DES REPAS OU ENTRE LES REPAS","T2_FRUITFRAI","A09R_T2_FRUITFRAI",null,305,"donnée","dico",null,"E9AREF_ALIM3F",null,null,"","","","","","","",null,"ALIMENTATION"]
[null,null,null,"Au cours du mois d'avril, pour cet aliment ou groupe d'aliments : Compotes, quelle a été la fréquence de sa consommation que ce soit AU COURS DES REPAS OU ENTRE LES REPAS","T2_COMPOT","A09R_T2_COMPOT",null,306,"donnée","dico",null,"E9AREF_ALIM3F",null,null,"","","","","","","",null,"ALIMENTATION"]
[null,null,null,"Au cours du mois d'avril, pour cet aliment ou groupe d'aliments : Jus de fruits, quelle a été la fréquence de sa consommation que ce soit AU COURS DES REPAS OU ENTRE LES REPAS","T2_JUSFRUIT","A09R_T2_JUSFRUIT",null,307,"donnée","dico",null,"E9AREF_ALIM3F",null,null,"","","","","","","",null,"ALIMENTATION"]
[null,null,null,"Au cours du mois d'avril, pour cet aliment ou groupe d'aliments : Sodas ordinaires, sirop, autres boissons sucrées, quelle a été la fréquence de sa consommation que ce soit AU COURS DES REPAS OU ENTRE LES REPAS","T2_BOISSONSUC","A09R_T2_BOISSONSUC",null,308,"donnée","dico",null,"E9AREF_ALIM3F",null,null,"","","","","","","",null,"ALIMENTATION"]
[null,null,null,"Au cours du mois d'avril, pour cet aliment ou groupe d'aliments : Sodas « light », quelle a été la fréquence de sa consommation que ce soit AU COURS DES REPAS OU ENTRE LES REPAS","T2_SODALIGHT","A09R_T2_SODALIGHT",null,309,"donnée","dico",null,"E9AREF_ALIM3F",null,null,"","","","","","","",null,"ALIMENTATION"]
[null,null,null,"Au cours du mois d'avril, pour cet aliment ou groupe d'aliments : Viennoiseries, biscuits, gâteaux, pâtisseries, quelle a été la fréquence de sa consommation que ce soit AU COURS DES REPAS OU ENTRE LES REPAS","T2_VIENBISGAT","A09R_T2_VIENBISGAT",null,310,"donnée","dico",null,"E9AREF_ALIM3F",null,null,"","","","","","","",null,"ALIMENTATION"]
[null,null,null,"Au cours du mois d'avril, pour cet aliment ou groupe d'aliments : Bonbons, chocolat, quelle a été la fréquence de sa consommation que ce soit AU COURS DES REPAS OU ENTRE LES REPAS","T2_BONCHOC","A09R_T2_BONCHOC",null,311,"donnée","dico",null,"E9AREF_ALIM3F",null,null,"","","","","","","",null,"ALIMENTATION"]
[null,null,null,"Diriez-vous que votre relation affective avec votre conjoint.e/partenaire a changé depuis le début du confinement ?","T2_FAMILLEQ07","A09R_T2_FAMILLEQ07",null,312,"donnée","dico",null,"E9AREF_FAMILLE6F",null,null,"","","","","","","",null,"ALIMENTATION"]
[null,null,null,"Depuis le début du confinement, vous êtes-vous disputé.e avec votre conjoint.e/partenaire au sujet de la vie quotidienne, des enfants ou de la vie professionnelle ?","T2_FAMILLEQ08","A09R_T2_FAMILLEQ08",null,313,"donnée","dico",null,"E9AREF_FAMILLE5_T2F",null,null,"","","","","","","",null,"ALIMENTATION"]
[null,null,null,"En matière de tâches domestiques et de prise en charge des enfants, lorsque vous comparez la période de confinement à la période antérieure, comment a évolué le partage des tâches entre vous et votre conjoint.e. ?","T2_FAMILLEQ01","A09R_T2_FAMILLEQ01",null,314,"donnée","dico",null,"E9AREF_FAMILLE1F",null,null,"","","","","","","",null,"ALIMENTATION"]
[null,null,null,"Actuellement dans votre foyer qui prend en charge les tâches domestiques courantes ?","T2_FAMILLEQ02","A09R_T2_FAMILLEQ02",null,315,"donnée","dico",null,"E9AREF_FAMILLE2F",null,null,"","","","","","","",null,"ALIMENTATION"]
[null,null,null,"Diriez-vous que vos relations avec votre ou vos enfants sont aujourd’hui :","T2_FAMILLEQ04","A09R_T2_FAMILLEQ04",null,316,"donnée","dico",null,"E9AREF_FAMILLE3F",null,null,"","","","","","","",null,"ALIMENTATION",null,0]
[null,null,null,"OCCUPATIONS ET LOISIRS EN FAMILLE",null,null,null,null,null,null,null,null,null,null,null,null,null,null,null,null,null,null,null,null,1]
[null,null,null,"Depuis le début de la période de confinement, est-ce que vous avez pu faire l'activité suivante avec votre enfant, tous les deux ensemble ? De la cuisine","T2_OCCUP_R01","A09R_T2_OCCUP_R01",null,317,"donnée","dico",null,"E9AREF_YORN",null,null,"","","","","","","",null,"OCCUPATIONS ET LOISIRS EN FAMILLE"]
[null,null,null,"Depuis le début de la période de confinement, est-ce que votre conjoint a pu faire l'activité suivante avec votre enfant, tous les deux ensemble ? De la cuisine","T2_OCCUP_C01","A09R_T2_OCCUP_C01",null,318,"donnée","dico",null,"E9AREF_YORN",null,null,"","","","","","","",null,"OCCUPATIONS ET LOISIRS EN FAMILLE"]
[null,null,null,"Depuis le début de la période de confinement, est-ce que vous et votre conjoint avez pu faire l'activité suivante avec votre enfant, tous les trois ensemble ? De la cuisine","T2_OCCUP_F01","A09R_T2_OCCUP_F01",null,319,"donnée","dico",null,"E9AREF_YORN",null,null,"","","","","","","",null,"OCCUPATIONS ET LOISIRS EN FAMILLE"]
[null,null,null,"Depuis le début de la période de confinement, est-ce que vous avez pu faire l'activité suivante avec votre enfant, tous les deux ensemble ? Du bricolage","T2_OCCUP_R02","A09R_T2_OCCUP_R02",null,320,"donnée","dico",null,"E9AREF_YORN",null,null,"","","","","","","",null,"OCCUPATIONS ET LOISIRS EN FAMILLE"]
[null,null,null,"Depuis le début de la période de confinement, est-ce que votre conjoint a pu faire l'activité suivante avec votre enfant, tous les deux ensemble ? Du bricolage","T2_OCCUP_C02","A09R_T2_OCCUP_C02",null,321,"donnée","dico",null,"E9AREF_YORN",null,null,"","","","","","","",null,"OCCUPATIONS ET LOISIRS EN FAMILLE"]
[null,null,null,"Depuis le début de la période de confinement, est-ce que vous et votre conjoint avez pu faire l'activité suivante avec votre enfant, tous les trois ensemble ? Du bricolage","T2_OCCUP_F02","A09R_T2_OCCUP_F02",null,322,"donnée","dico",null,"E9AREF_YORN",null,null,"","","","","","","",null,"OCCUPATIONS ET LOISIRS EN FAMILLE"]
[null,null,null,"Depuis le début de la période de confinement, est-ce que vous avez pu faire l'activité suivante avec votre enfant, tous les deux ensemble ? De la couture","T2_OCCUP_R03","A09R_T2_OCCUP_R03",null,323,"donnée","dico",null,"E9AREF_YORN",null,null,"","","","","","","",null,"OCCUPATIONS ET LOISIRS EN FAMILLE"]
[null,null,null,"Depuis le début de la période de confinement, est-ce que votre conjoint a pu faire l'activité suivante avec votre enfant, tous les deux ensemble ? De la couture","T2_OCCUP_C03","A09R_T2_OCCUP_C03",null,324,"donnée","dico",null,"E9AREF_YORN",null,null,"","","","","","","",null,"OCCUPATIONS ET LOISIRS EN FAMILLE"]
[null,null,null,"Depuis le début de la période de confinement, est-ce que vous et votre conjoint avez pu faire l'activité suivante avec votre enfant, tous les trois ensemble ? De la couture","T2_OCCUP_F03","A09R_T2_OCCUP_F03",null,325,"donnée","dico",null,"E9AREF_YORN",null,null,"","","","","","","",null,"OCCUPATIONS ET LOISIRS EN FAMILLE"]
[null,null,null,"Depuis le début de la période de confinement, est-ce que vous avez pu faire l'activité suivante avec votre enfant, tous les deux ensemble ? Du jardinage","T2_OCCUP_R04","A09R_T2_OCCUP_R04",null,326,"donnée","dico",null,"E9AREF_YORN",null,null,"","","","","","","",null,"OCCUPATIONS ET LOISIRS EN FAMILLE"]
[null,null,null,"Depuis le début de la période de confinement, est-ce que votre conjoint a pu faire l'activité suivante avec votre enfant, tous les deux ensemble ? Du jardinage","T2_OCCUP_C04","A09R_T2_OCCUP_C04",null,327,"donnée","dico",null,"E9AREF_YORN",null,null,"","","","","","","",null,"OCCUPATIONS ET LOISIRS EN FAMILLE"]
[null,null,null,"Depuis le début de la période de confinement, est-ce que vous et votre conjoint avez pu faire l'activité suivante avec votre enfant, tous les trois ensemble ? Du jardinage","T2_OCCUP_F04","A09R_T2_OCCUP_F04",null,328,"donnée","dico",null,"E9AREF_YORN",null,null,"","","","","","","",null,"OCCUPATIONS ET LOISIRS EN FAMILLE"]
[null,null,null,"Depuis le début de la période de confinement, est-ce que vous avez pu faire l'activité suivante avec votre enfant, tous les deux ensemble ? Un grand rangement de sa chambre","T2_OCCUP_R05","A09R_T2_OCCUP_R05",null,329,"donnée","dico",null,"E9AREF_YORN",null,null,"","","","","","","",null,"OCCUPATIONS ET LOISIRS EN FAMILLE"]
[null,null,null,"Depuis le début de la période de confinement, est-ce que votre conjoint a pu faire l'activité suivante avec votre enfant, tous les deux ensemble ? Un grand rangement de sa chambre","T2_OCCUP_C05","A09R_T2_OCCUP_C05",null,330,"donnée","dico",null,"E9AREF_YORN",null,null,"","","","","","","",null,"OCCUPATIONS ET LOISIRS EN FAMILLE"]
[null,null,null,"Depuis le début de la période de confinement, est-ce que vous et votre conjoint avez pu faire l'activité suivante avec votre enfant, tous les trois ensemble ? Un grand rangement de sa chambre","T2_OCCUP_F05","A09R_T2_OCCUP_F05",null,331,"donnée","dico",null,"E9AREF_YORN",null,null,"","","","","","","",null,"OCCUPATIONS ET LOISIRS EN FAMILLE"]
[null,null,null,"Depuis le début de la période de confinement, est-ce que vous avez pu faire l'activité suivante avec votre enfant, tous les deux ensemble ? Un grand rangement d’autres pièces de la maison","T2_OCCUP_R06","A09R_T2_OCCUP_R06",null,332,"donnée","dico",null,"E9AREF_YORN",null,null,"","","","","","","",null,"OCCUPATIONS ET LOISIRS EN FAMILLE"]
[null,null,null,"Depuis le début de la période de confinement, est-ce que votre conjoint a pu faire l'activité suivante avec votre enfant, tous les deux ensemble ? Un grand rangement d’autres pièces de la maison","T2_OCCUP_C06","A09R_T2_OCCUP_C06",null,333,"donnée","dico",null,"E9AREF_YORN",null,null,"","","","","","","",null,"OCCUPATIONS ET LOISIRS EN FAMILLE"]
[null,null,null,"Depuis le début de la période de confinement, est-ce que vous et votre conjoint avez pu faire l'activité suivante avec votre enfant, tous les trois ensemble ? Un grand rangement d’autres pièces de la maison","T2_OCCUP_F06","A09R_T2_OCCUP_F06",null,334,"donnée","dico",null,"E9AREF_YORN",null,null,"","","","","","","",null,"OCCUPATIONS ET LOISIRS EN FAMILLE"]
[null,null,null,"Depuis le début de la période de confinement, est-ce que vous avez pu faire l'activité suivante avec votre enfant, tous les deux ensemble ? Lui faire découvrir des films ou des séries que vous aimez","T2_OCCUP_R07","A09R_T2_OCCUP_R07",null,335,"donnée","dico",null,"E9AREF_YORN",null,null,"","","","","","","",null,"OCCUPATIONS ET LOISIRS EN FAMILLE"]
[null,null,null,"Depuis le début de la période de confinement, est-ce que votre conjoint a pu faire l'activité suivante avec votre enfant, tous les deux ensemble ? Lui faire découvrir des films ou des séries que vous aimez","T2_OCCUP_C07","A09R_T2_OCCUP_C07",null,336,"donnée","dico",null,"E9AREF_YORN",null,null,"","","","","","","",null,"OCCUPATIONS ET LOISIRS EN FAMILLE"]
[null,null,null,"Depuis le début de la période de confinement, est-ce que vous et votre conjoint avez pu faire l'activité suivante avec votre enfant, tous les trois ensemble ? Lui faire découvrir des films ou des séries que vous aimez","T2_OCCUP_F07","A09R_T2_OCCUP_F07",null,337,"donnée","dico",null,"E9AREF_YORN",null,null,"","","","","","","",null,"OCCUPATIONS ET LOISIRS EN FAMILLE"]
[null,null,null,"Depuis le début de la période de confinement, est-ce que vous avez pu faire l'activité suivante avec votre enfant, tous les deux ensemble ? Faire de la musique, du chant ou du théâtre","T2_OCCUP_R08","A09R_T2_OCCUP_R08",null,338,"donnée","dico",null,"E9AREF_YORN",null,null,"","","","","","","",null,"OCCUPATIONS ET LOISIRS EN FAMILLE"]
[null,null,null,"Depuis le début de la période de confinement, est-ce que votre conjoint a pu faire l'activité suivante avec votre enfant, tous les deux ensemble ? Faire de la musique, du chant ou du théâtre","T2_OCCUP_C08","A09R_T2_OCCUP_C08",null,339,"donnée","dico",null,"E9AREF_YORN",null,null,"","","","","","","",null,"OCCUPATIONS ET LOISIRS EN FAMILLE"]
[null,null,null,"Depuis le début de la période de confinement, est-ce que vous et votre conjoint avez pu faire l'activité suivante avec votre enfant, tous les trois ensemble ? Faire de la musique, du chant ou du théâtre","T2_OCCUP_F08","A09R_T2_OCCUP_F08",null,340,"donnée","dico",null,"E9AREF_YORN",null,null,"","","","","","","",null,"OCCUPATIONS ET LOISIRS EN FAMILLE"]
[null,null,null,"Depuis le début de la période de confinement, est-ce que vous avez pu faire l'activité suivante avec votre enfant, tous les deux ensemble ? Monter des photos ou des vidéos","T2_OCCUP_R09","A09R_T2_OCCUP_R09",null,341,"donnée","dico",null,"E9AREF_YORN",null,null,"","","","","","","",null,"OCCUPATIONS ET LOISIRS EN FAMILLE"]
[null,null,null,"Depuis le début de la période de confinement, est-ce que votre conjoint a pu faire l'activité suivante avec votre enfant, tous les deux ensemble ? Monter des photos ou des vidéos","T2_OCCUP_C09","A09R_T2_OCCUP_C09",null,342,"donnée","dico",null,"E9AREF_YORN",null,null,"","","","","","","",null,"OCCUPATIONS ET LOISIRS EN FAMILLE"]
[null,null,null,"Depuis le début de la période de confinement, est-ce que vous et votre conjoint avez pu faire l'activité suivante avec votre enfant, tous les trois ensemble ? Monter des photos ou des vidéos","T2_OCCUP_F09","A09R_T2_OCCUP_F09",null,343,"donnée","dico",null,"E9AREF_YORN",null,null,"","","","","","","",null,"OCCUPATIONS ET LOISIRS EN FAMILLE"]
[null,null,null,"Depuis le début de la période de confinement, est-ce que vous avez pu faire l'activité suivante avec votre enfant, tous les deux ensemble ? Le faire participer à votre travail","T2_OCCUP_R010","A09R_T2_OCCUP_R010",null,344,"donnée","dico",null,"E9AREF_YORN",null,null,"","","","","","","",null,"OCCUPATIONS ET LOISIRS EN FAMILLE"]
[null,null,null,"Depuis le début de la période de confinement, est-ce que votre conjoint a pu faire l'activité suivante avec votre enfant, tous les deux ensemble ? Le faire participer à votre travail","T2_OCCUP_C010","A09R_T2_OCCUP_C010",null,345,"donnée","dico",null,"E9AREF_YORN",null,null,"","","","","","","",null,"OCCUPATIONS ET LOISIRS EN FAMILLE"]
[null,null,null,"Depuis le début de la période de confinement, est-ce que vous et votre conjoint avez pu faire l'activité suivante avec votre enfant, tous les trois ensemble ? Le faire participer à votre travail","T2_OCCUP_F010","A09R_T2_OCCUP_F010",null,346,"donnée","dico",null,"E9AREF_YORN",null,null,"","","","","","","",null,"OCCUPATIONS ET LOISIRS EN FAMILLE"]
[null,null,null,"Dans les 7 derniers jours, en moyenne, combien d'heures par jour votre enfant a consacré  à la lecture, une activité artistique ou jeux de société (non connectés) :","T2_LOISIRQ01H","A09R_T2_LOISIRQ01H",null,347,"donnée","dico",null,"",null,null,"","","","","","","",null,"OCCUPATIONS ET LOISIRS EN FAMILLE"]
[null,null,null,"Dans les 7 derniers jours, en moyenne, combien de minutes par jour votre enfant a consacré à la lecture, une activité artistique ou jeux de société (non connectés) :","T2_LOISIRQ01M","A09R_T2_LOISIRQ01M",null,348,"donnée","dico",null,"",null,null,"","","","","","","",null,"OCCUPATIONS ET LOISIRS EN FAMILLE"]
[null,null,null,"Dans les 7 derniers jours, en moyenne, combien d'heures par jour votre enfant a consacré à des jeux sur console ou en ligne :","T2_LOISIRQ02H","A09R_T2_LOISIRQ02H",null,349,"donnée","dico",null,"",null,null,"","","","","","","",null,"OCCUPATIONS ET LOISIRS EN FAMILLE"]
[null,null,null,"Dans les 7 derniers jours, en moyenne, combien de minutes par jour votre enfant a consacré à des jeux sur console ou en ligne :","T2_LOISIRQ02M","A09R_T2_LOISIRQ02M",null,350,"donnée","dico",null,"",null,null,"","","","","","","",null,"OCCUPATIONS ET LOISIRS EN FAMILLE"]
[null,null,null,"Dans les 7 derniers jours, en moyenne, combien d'heures par jour votre enfant a consacré aux réseaux sociaux (facebook, instagram, snapchat, etc.) :","T2_LOISIRQ03H","A09R_T2_LOISIRQ03H",null,351,"donnée","dico",null,"",null,null,"","","","","","","",null,"OCCUPATIONS ET LOISIRS EN FAMILLE"]
[null,null,null,"Dans les 7 derniers jours, en moyenne, combien de minutes par jour votre enfant a consacré aux réseaux sociaux (facebook, instagram, snapchat, etc.) :","T2_LOISIRQ03M","A09R_T2_LOISIRQ03M",null,352,"donnée","dico",null,"",null,null,"","","","","","","",null,"OCCUPATIONS ET LOISIRS EN FAMILLE"]
[null,null,null,"Dans les 7 derniers jours, en moyenne, combien d'heures par jour votre enfant a consacré à la télévision ou d’autres écrans pour suivre des programmes scolaires ou éducatifs :","T2_LOISIRQ04H","A09R_T2_LOISIRQ04H",null,353,"donnée","dico",null,"",null,null,"","","","","","","",null,"OCCUPATIONS ET LOISIRS EN FAMILLE"]
[null,null,null,"Dans les 7 derniers jours, en moyenne, combien de minutes par jour votre enfant a consacré à la télévision ou d’autres écrans pour suivre des programmes scolaires ou éducatifs :","T2_LOISIRQ04M","A09R_T2_LOISIRQ04M",null,354,"donnée","dico",null,"",null,null,"","","","","","","",null,"OCCUPATIONS ET LOISIRS EN FAMILLE"]
[null,null,null,"Dans les 7 derniers jours, en moyenne, combien d'heures par jour votre enfant a consacré à la télévision ou d’autres écrans pour d’autres programmes :","T2_LOISIRQ05H","A09R_T2_LOISIRQ05H",null,355,"donnée","dico",null,"",null,null,"","","","","","","",null,"OCCUPATIONS ET LOISIRS EN FAMILLE"]
[null,null,null,"Dans les 7 derniers jours, en moyenne, combien de minutes par jour votre enfant a consacré à la télévision ou d’autres écrans pour d’autres programmes :","T2_LOISIRQ05M","A09R_T2_LOISIRQ05M",null,356,"donnée","dico",null,"",null,null,"","","","","","","",null,"OCCUPATIONS ET LOISIRS EN FAMILLE"]
[null,null,null,"Dans les 7 derniers jours, en moyenne, combien d'heures par jour votre enfant a consacré au sport ou promenade hors du domicile :","T2_LOISIRQ06H","A09R_T2_LOISIRQ06H",null,357,"donnée","dico",null,"",null,null,"","","","","","","",null,"OCCUPATIONS ET LOISIRS EN FAMILLE"]
[null,null,null,"Dans les 7 derniers jours, en moyenne, combien de minutes par jour votre enfant a consacré au sport ou promenade hors du domicile :","T2_LOISIRQ06M","A09R_T2_LOISIRQ06M",null,358,"donnée","dico",null,"",null,null,"","","","","","","",null,"OCCUPATIONS ET LOISIRS EN FAMILLE"]
[null,null,null,"Dans les 7 derniers jours, en moyenne, combien d'heures par jour votre enfant a consacré à des activités physiques dans le domicile :","T2_LOISIRQ07H","A09R_T2_LOISIRQ07H",null,359,"donnée","dico",null,"",null,null,"","","","","","","",null,"OCCUPATIONS ET LOISIRS EN FAMILLE"]
[null,null,null,"Dans les 7 derniers jours, en moyenne, combien de minutes par jour votre enfant a consacré à des activités physiques dans le domicile :","T2_LOISIRQ07M","A09R_T2_LOISIRQ07M",null,360,"donnée","dico",null,"",null,null,"","","","","","","",null,"OCCUPATIONS ET LOISIRS EN FAMILLE"]
[null,null,null,"Dans les 7 derniers jours, en moyenne, combien d'heures par jour votre enfant a consacré à des activités physiques dans la cour ou le jardin du domicile :","T2_LOISIRQ08H","A09R_T2_LOISIRQ08H",null,361,"donnée","dico",null,"",null,null,"","","","","","","",null,"OCCUPATIONS ET LOISIRS EN FAMILLE"]
[null,null,null,"Dans les 7 derniers jours, en moyenne, combien de minutes par jour votre enfant a consacré à des activités physiques dans la cour ou le jardin du domicile :","T2_LOISIRQ08M","A09R_T2_LOISIRQ08M",null,362,"donnée","dico",null,"",null,null,"","","","","","","",null,"OCCUPATIONS ET LOISIRS EN FAMILLE"]
[null,null,null,"Pour cette activité, indiquez s’il/elle y a consacré plus ou moins de temps qu’avant le confinement? La lecture, le dessin, les jeux de société (non connectés)","T2_LOISIRQ9","A09R_T2_LOISIRQ9",null,363,"donnée","dico",null,"E9AREF_LOISIRS2F",null,null,"","","","","","","",null,"OCCUPATIONS ET LOISIRS EN FAMILLE"]
[null,null,null,"Pour cette activité, indiquez s’il/elle y a consacré plus ou moins de temps qu’avant le confinement? Les jeux sur console ou en ligne","T2_LOISIRQ10","A09R_T2_LOISIRQ10",null,364,"donnée","dico",null,"E9AREF_LOISIRS2F",null,null,"","","","","","","",null,"OCCUPATIONS ET LOISIRS EN FAMILLE"]
[null,null,null,"Pour cette activité, indiquez s’il/elle y a consacré plus ou moins de temps qu’avant le confinement? Les réseaux sociaux (facebook, instagram, snapchat, etc.)","T2_LOISIRQ11","A09R_T2_LOISIRQ11",null,365,"donnée","dico",null,"E9AREF_LOISIRS2F",null,null,"","","","","","","",null,"OCCUPATIONS ET LOISIRS EN FAMILLE"]
[null,null,null,"Pour cette activité, indiquez s’il/elle y a consacré plus ou moins de temps qu’avant le confinement? La télévision ou d’autres écrans pour suivre des programmes scolaires ou éducatifs","T2_LOISIRQ12","A09R_T2_LOISIRQ12",null,366,"donnée","dico",null,"E9AREF_LOISIRS2F",null,null,"","","","","","","",null,"OCCUPATIONS ET LOISIRS EN FAMILLE"]
[null,null,null,"Pour cette activité, indiquez s’il/elle y a consacré plus ou moins de temps qu’avant le confinement? Télévision Jeux sur console ou en ligne ou autres écrans pour le loisir","T2_LOISIRQ13","A09R_T2_LOISIRQ13",null,367,"donnée","dico",null,"E9AREF_LOISIRS2F",null,null,"","","","","","","",null,"OCCUPATIONS ET LOISIRS EN FAMILLE"]
[null,null,null,"Pour cette activité, indiquez s’il/elle y a consacré plus ou moins de temps qu’avant le confinement? Sport ou promenade hors du domicile","T2_LOISIRQ14","A09R_T2_LOISIRQ14",null,368,"donnée","dico",null,"E9AREF_LOISIRS2F",null,null,"","","","","","","",null,"OCCUPATIONS ET LOISIRS EN FAMILLE"]
[null,null,null,"Pour cette activité, indiquez s’il/elle y a consacré plus ou moins de temps qu’avant le confinement? Activités physiques dans le domicile","T2_LOISIRQ15","A09R_T2_LOISIRQ15",null,369,"donnée","dico",null,"E9AREF_LOISIRS2F",null,null,"","","","","","","",null,"OCCUPATIONS ET LOISIRS EN FAMILLE"]
[null,null,null,"Pour cette activité, indiquez s’il/elle y a consacré plus ou moins de temps qu’avant le confinement? Activités physiques dans la cour ou le jardin du domicile","T2_LOISIRQ16","A09R_T2_LOISIRQ16",null,370,"donnée","dico",null,"E9AREF_LOISIRS2F",null,null,"","","","","","","",null,"OCCUPATIONS ET LOISIRS EN FAMILLE",null,0]
[null,null,null,"COMPORTEMENT ET SOMMEIL DE L’ENFANT",null,null,null,null,null,null,null,null,null,null,null,null,null,null,null,null,null,null,null,null,1]
[null,null,null,"Au cours des 15 derniers jours, votre enfant s’est-il plaint souvent de maux de tête ou de ventre ou de nausées ?","T2_COMPORTQ01","A09R_T2_COMPORTQ01",null,371,"donnée","dico",null,"E9AREF_COMPORT1F",null,null,"","","","","","","",null,"COMPORTEMENT ET SOMMEIL DE L’ENFANT"]
[null,null,null,"Au cours des 15 derniers jours, votre enfant a-t-il été agité, hyperactif, ne tenait pas en place ?","T2_COMPORTQ02","A09R_T2_COMPORTQ02",null,372,"donnée","dico",null,"E9AREF_COMPORT1F",null,null,"","","","","","","",null,"COMPORTEMENT ET SOMMEIL DE L’ENFANT"]
[null,null,null,"Au cours des 15 derniers jours, votre enfant s’est-il inquiété souvent, a paru souvent soucieux ?","T2_COMPORTQ03","A09R_T2_COMPORTQ03",null,373,"donnée","dico",null,"E9AREF_COMPORT1F",null,null,"","","","","","","",null,"COMPORTEMENT ET SOMMEIL DE L’ENFANT"]
[null,null,null,"Au cours des 15 derniers jours, votre enfant n’a pas tenu en place ou s’est tortillé constamment ?","T2_COMPORTQ04","A09R_T2_COMPORTQ04",null,374,"donnée","dico",null,"E9AREF_COMPORT1F",null,null,"","","","","","","",null,"COMPORTEMENT ET SOMMEIL DE L’ENFANT"]
[null,null,null,"Au cours des 15 derniers jours, votre enfant a-t-il été souvent malheureux, abattu, ou a-t-il pleuré souvent ?","T2_COMPORTQ05","A09R_T2_COMPORTQ05",null,375,"donnée","dico",null,"E9AREF_COMPORT1F",null,null,"","","","","","","",null,"COMPORTEMENT ET SOMMEIL DE L’ENFANT"]
[null,null,null,"Au cours des 15 derniers jours, votre enfant a-t-il été facilement distrait, ou a-t-il eu du mal à se concentrer ?","T2_COMPORTQ06","A09R_T2_COMPORTQ06",null,376,"donnée","dico",null,"E9AREF_COMPORT1F",null,null,"","","","","","","",null,"COMPORTEMENT ET SOMMEIL DE L’ENFANT"]
[null,null,null,"Au cours des 15 derniers jours, votre enfant a-t-il été anxieux, ou s’est-il cramponné aux adultes dans les situations nouvelles, a-t-il perdu facilement ses moyens ?","T2_COMPORTQ07","A09R_T2_COMPORTQ07",null,377,"donnée","dico",null,"E9AREF_COMPORT1F",null,null,"","","","","","","",null,"COMPORTEMENT ET SOMMEIL DE L’ENFANT"]
[null,null,null,"Au cours des 15 derniers jours, votre enfant a-t-il réfléchit avant d’agir ?","T2_COMPORTQ08","A09R_T2_COMPORTQ08",null,378,"donnée","dico",null,"E9AREF_COMPORT1F",null,null,"","","","","","","",null,"COMPORTEMENT ET SOMMEIL DE L’ENFANT"]
[null,null,null,"Au cours des 15 derniers jours, votre enfant a-t-il eu de nombreuses peurs, a-t-il été facilement effrayé ?","T2_COMPORTQ09","A09R_T2_COMPORTQ09",null,379,"donnée","dico",null,"E9AREF_COMPORT1F",null,null,"","","","","","","",null,"COMPORTEMENT ET SOMMEIL DE L’ENFANT"]
[null,null,null,"Au cours des 15 derniers jours, votre enfant a-t-il été au bout des tâches ou devoirs, et maintenait-il bien son attention ?","T2_COMPORTQ10","A09R_T2_COMPORTQ10",null,380,"donnée","dico",null,"E9AREF_COMPORT1F",null,null,"","","","","","","",null,"COMPORTEMENT ET SOMMEIL DE L’ENFANT"]
[null,null,null,"Diriez-vous que le temps de sommeil de votre enfant a changé depuis le début du confinement ?","T2_COMPORTQ12","A09R_T2_COMPORTQ12",null,381,"donnée","dico",null,"E9AREF_COMPORT3F",null,null,"","","","","","","",null,"COMPORTEMENT ET SOMMEIL DE L’ENFANT"]
[null,null,null,"Diriez-vous que depuis le début du confinement, votre enfant a des difficultés pour dormir (comme des difficultés d’endormissement, des réveils nocturnes fréquents ou trop tôt sans possibilité de rendormissement) :","T2_COMPORTQ13","A09R_T2_COMPORTQ13",null,382,"donnée","dico",null,"E9AREF_COMPORT4F",null,null,"","","","","","","",null,"COMPORTEMENT ET SOMMEIL DE L’ENFANT",null,0]
[null,null,null,"TRAVAIL SCOLAIRE PENDANT LE CONFINEMENT",null,null,null,null,null,null,null,null,null,null,null,null,null,null,null,null,null,null,null,null,1]
[null,null,null,"Avant le confinement, votre enfant était :","T2_SCOLQ01","A09R_T2_SCOLQ01",null,383,"donnée","dico",null,"E9AREF_SCOLAR1F",null,null,"","","","","","","",null,"TRAVAIL SCOLAIRE PENDANT LE CONFINEMENT"]
[null,null,null,"En quelle classe est votre enfant ?","T2_SCOLQ02","A09R_T2_SCOLQ02",null,384,"donnée","dico",null,"E9AREF_SCOLAR2F",null,null,"","","","","","","",null,"TRAVAIL SCOLAIRE PENDANT LE CONFINEMENT"]
[null,null,null,"Avant le confinement, votre enfant était-il scolarisé ?","T2_SCOLQ01BIS","A09R_T2_SCOLQ01BIS",null,385,"donnée","dico",null,"E9AREF_YORN",null,null,"","","","","","","",null,"TRAVAIL SCOLAIRE PENDANT LE CONFINEMENT"]
[null,null,null,"Votre enfant est-il actuellement en vacances scolaires ?","T2_SCOLQ03","A09R_T2_SCOLQ03",null,386,"donnée","dico",null,"E9AREF_YORN",null,null,"","","","","","","",null,"TRAVAIL SCOLAIRE PENDANT LE CONFINEMENT"]
[null,null,null,"Au cours de cette période, votre enfant a-t-il été accueilli dans une école ?","T2_SCOLQ04","A09R_T2_SCOLQ04",null,387,"donnée","dico",null,"E9AREF_YORN",null,null,"","","","","","","",null,"TRAVAIL SCOLAIRE PENDANT LE CONFINEMENT"]
[null,null,null,"Est-ce que c’était dans son école habituelle ?","T2_SCOLQ05","A09R_T2_SCOLQ05",null,388,"donnée","dico",null,"E9AREF_YORN",null,null,"","","","","","","",null,"TRAVAIL SCOLAIRE PENDANT LE CONFINEMENT"]
[null,null,null,"Est-ce que c’était pour la totalité des heures de classe ?","T2_SCOLQ06","A09R_T2_SCOLQ06",null,389,"donnée","dico",null,"E9AREF_YORN",null,null,"","","","","","","",null,"TRAVAIL SCOLAIRE PENDANT LE CONFINEMENT"]
[null,null,null,"Depuis le 11 mai, date de déconfinement, votre enfant a-t-il été accueilli dans une école ?","T2_SCOLQ27","A09R_T2_SCOLQ27",null,390,"donnée","dico",null,"E9AREF_YORN",null,null,"","","","","","","",null,"TRAVAIL SCOLAIRE PENDANT LE CONFINEMENT"]
[null,null,null,"Est-ce pour :","T2_SCOLQ28","A09R_T2_SCOLQ28",null,391,"donnée","dico",null,"E9AREF_SCOLAR18F",null,null,"","","","","","","",null,"TRAVAIL SCOLAIRE PENDANT LE CONFINEMENT"]
[null,null,null,"Par rapport aux premières semaines de confinement en mars, le temps que votre enfant consacre aujourd’hui au travail scolaire a :","T2_SCOLQ20","A09R_T2_SCOLQ20",null,392,"donnée","dico",null,"E9AREF_SCOLAR13F",null,null,"","","","","","","",null,"TRAVAIL SCOLAIRE PENDANT LE CONFINEMENT"]
[null,null,null,"Est-ce parce qu'il : Se met de mieux en mieux au travail","T2_SCOLQ21M_A","A09R_T2_SCOLQ21M_A",null,393,"donnée","dico",null,"E9AREF_COCHE",null,null,"","","","","","","",null,"TRAVAIL SCOLAIRE PENDANT LE CONFINEMENT"]
[null,null,null,"Est-ce parce qu'il : Reçoit plus de travail à faire","T2_SCOLQ21M_B","A09R_T2_SCOLQ21M_B",null,394,"donnée","dico",null,"E9AREF_COCHE",null,null,"","","","","","","",null,"TRAVAIL SCOLAIRE PENDANT LE CONFINEMENT"]
[null,null,null,"Est-ce parce qu'il : A moins de difficultés informatiques","T2_SCOLQ21M_C","A09R_T2_SCOLQ21M_C",null,395,"donnée","dico",null,"E9AREF_COCHE",null,null,"","","","","","","",null,"TRAVAIL SCOLAIRE PENDANT LE CONFINEMENT"]
[null,null,null,"Est-ce parce qu'il : Se met de moins en moins bien au travail","T2_SCOLQ22M_A","A09R_T2_SCOLQ22M_A",null,396,"donnée","dico",null,"E9AREF_COCHE",null,null,"","","","","","","",null,"TRAVAIL SCOLAIRE PENDANT LE CONFINEMENT"]
[null,null,null,"Est-ce parce qu'il : Reçoit moins de travail à faire","T2_SCOLQ22M_B","A09R_T2_SCOLQ22M_B",null,397,"donnée","dico",null,"E9AREF_COCHE",null,null,"","","","","","","",null,"TRAVAIL SCOLAIRE PENDANT LE CONFINEMENT"]
[null,null,null,"Est-ce parce qu'il : A plus de difficultés informatiques","T2_SCOLQ22M_C","A09R_T2_SCOLQ22M_C",null,398,"donnée","dico",null,"E9AREF_COCHE",null,null,"","","","","","","",null,"TRAVAIL SCOLAIRE PENDANT LE CONFINEMENT"]
[null,null,null,"Toujours au cours de cette période, est-ce que votre enfant a pu s’isoler pour travailler ?","T2_SCOLQ13","A09R_T2_SCOLQ13",null,399,"donnée","dico",null,"E9AREF_SCOLAR8F",null,null,"","","","","","","",null,"TRAVAIL SCOLAIRE PENDANT LE CONFINEMENT"]
[null,null,null,"Par rapport aux premières semaines de confinement en mars, l’aide totale apportée à votre enfant par les membres du foyer a :","T2_SCOLQ23","A09R_T2_SCOLQ23",null,400,"donnée","dico",null,"E9AREF_SCOLAR13MODIF",null,null,"","","","","","","",null,"TRAVAIL SCOLAIRE PENDANT LE CONFINEMENT"]
[null,null,null,"Par rapport aux premières semaines de confinement en mars, diriez-vous que les membres du foyer qui l’aident, éprouvent ?","T2_SCOLQ24","A09R_T2_SCOLQ24",null,401,"donnée","dico",null,"E9AREF_SCOLAR15F",null,null,"","","","","","","",null,"TRAVAIL SCOLAIRE PENDANT LE CONFINEMENT"]
[null,null,null,"Quelles ont été ces difficultés ? Que l’enfant accepte de faire le travail","T2_SCOLQ18M_A","A09R_T2_SCOLQ18M_A",null,402,"donnée","dico",null,"E9AREF_COCHE",null,null,"","","","","","","",null,"TRAVAIL SCOLAIRE PENDANT LE CONFINEMENT"]
[null,null,null,"Quelles ont été ces difficultés ? Que l’enfant comprenne le travail","T2_SCOLQ18M_B","A09R_T2_SCOLQ18M_B",null,403,"donnée","dico",null,"E9AREF_COCHE",null,null,"","","","","","","",null,"TRAVAIL SCOLAIRE PENDANT LE CONFINEMENT"]
[null,null,null,"Quelles ont été ces difficultés ? Que la personne qui aide comprenne ce qui est demandé","T2_SCOLQ18M_C","A09R_T2_SCOLQ18M_C",null,404,"donnée","dico",null,"E9AREF_COCHE",null,null,"","","","","","","",null,"TRAVAIL SCOLAIRE PENDANT LE CONFINEMENT"]
[null,null,null,"Quelles ont été ces difficultés ? Que la personne qui aide trouve assez de temps","T2_SCOLQ18M_D","A09R_T2_SCOLQ18M_D",null,405,"donnée","dico",null,"E9AREF_COCHE",null,null,"","","","","","","",null,"TRAVAIL SCOLAIRE PENDANT LE CONFINEMENT"]
[null,null,null,"Depuis le début du confinement, avez-vous utilisé le dispositif du CNED « ma classe à la maison » ?","T2_SCOLQ19","A09R_T2_SCOLQ19",null,406,"donnée","dico",null,"E9AREF_SCOLAR12F",null,null,"","","","","","","",null,"TRAVAIL SCOLAIRE PENDANT LE CONFINEMENT"]
[null,null,null,"Diriez-vous que votre enfant vit mal le fait de ne pas aller en classe ?","T2_SCOLQ25","A09R_T2_SCOLQ25",null,407,"donnée","dico",null,"E9AREF_SORTIES8F",null,null,"","","","","","","",null,"TRAVAIL SCOLAIRE PENDANT LE CONFINEMENT"]
[null,null,null,"Est-ce parce que : Il aime bien son enseignant.e","T2_SCOLQ26M_A","A09R_T2_SCOLQ26M_A",null,408,"donnée","dico",null,"E9AREF_COCHE",null,null,"","","","","","","",null,"TRAVAIL SCOLAIRE PENDANT LE CONFINEMENT"]
[null,null,null,"Est-ce parce que : Il aime apprendre","T2_SCOLQ26M_B","A09R_T2_SCOLQ26M_B",null,409,"donnée","dico",null,"E9AREF_COCHE",null,null,"","","","","","","",null,"TRAVAIL SCOLAIRE PENDANT LE CONFINEMENT"]
[null,null,null,"Est-ce parce que : Il aime avoir ses moments en dehors de la vie de famille","T2_SCOLQ26M_C","A09R_T2_SCOLQ26M_C",null,410,"donnée","dico",null,"E9AREF_COCHE",null,null,"","","","","","","",null,"TRAVAIL SCOLAIRE PENDANT LE CONFINEMENT"]
[null,null,null,"Est-ce parce que : Il aime y retrouver ses copains/copines","T2_SCOLQ26M_D","A09R_T2_SCOLQ26M_D",null,411,"donnée","dico",null,"E9AREF_COCHE",null,null,"","","","","","","",null,"TRAVAIL SCOLAIRE PENDANT LE CONFINEMENT"]
[null,null,null,"Votre enfant a-t-il accès à un ordinateur/tablette (connecté à internet) ?","T2_EQUIPQ01","A09R_T2_EQUIPQ01",null,412,"donnée","dico",null,"E9AREF_EQUIP1F",null,null,"","","","","","","",null,"TRAVAIL SCOLAIRE PENDANT LE CONFINEMENT"]
[null,null,null,"Pour son travail scolaire, combien de temps par jour peut-il l’utiliser ?","T2_EQUIPQ02","A09R_T2_EQUIPQ02",null,413,"donnée","dico",null,"E9AREF_SCOLAR10F",null,null,"","","","","","","",null,"TRAVAIL SCOLAIRE PENDANT LE CONFINEMENT",null,0]
[null,null,null,"SORTIES",null,null,null,null,null,null,null,null,null,null,null,null,null,null,null,null,null,null,null,null,1]
[null,null,null,"La dernière fois que votre enfant est sorti, était-ce : Pour accompagner un adulte lors des achats de première nécessité","T2_SORTIEQ04M_A","A09R_T2_SORTIEQ04M_A",null,414,"donnée","dico",null,"E9AREF_COCHE",null,null,"","","","","","","",null,"SORTIES"]
[null,null,null,"La dernière fois que votre enfant est sorti, était-ce : Pour faire lui-même des achats de première nécessité","T2_SORTIEQ04M_B","A09R_T2_SORTIEQ04M_B",null,415,"donnée","dico",null,"E9AREF_COCHE",null,null,"","","","","","","",null,"SORTIES"]
[null,null,null,"La dernière fois que votre enfant est sorti, était-ce : Pour motif de santé","T2_SORTIEQ04M_C","A09R_T2_SORTIEQ04M_C",null,416,"donnée","dico",null,"E9AREF_COCHE",null,null,"","","","","","","",null,"SORTIES"]
[null,null,null,"La dernière fois que votre enfant est sorti, était-ce : Pour jouer dehors, faire de l’exercice physique ou promener des animaux de compagnie","T2_SORTIEQ04M_D","A09R_T2_SORTIEQ04M_D",null,417,"donnée","dico",null,"E9AREF_COCHE",null,null,"","","","","","","",null,"SORTIES"]
[null,null,null,"La dernière fois que votre enfant est sorti, était-ce : Pour une autre raison (voir un ami, loisirs, etc.)","T2_SORTIEQ04M_E","A09R_T2_SORTIEQ04M_E",null,418,"donnée","dico",null,"E9AREF_COCHE",null,null,"","","","","","","",null,"SORTIES"]
[null,null,null,"La dernière fois que votre enfant est sorti, était-ce : Votre enfant n’est pas sorti depuis le début du confinement","T2_SORTIEQ04M_F","A09R_T2_SORTIEQ04M_F",null,419,"donnée","dico",null,"E9AREF_COCHE",null,null,"","","","","","","",null,"SORTIES"]
[null,null,null,"Au total, la dernière fois qu’il est sorti combien de temps la sortie a t-elle duré ?","T2_SORTIEQ05","A09R_T2_SORTIEQ05",null,420,"donnée","dico",null,"E9AREF_SORTIES2F",null,null,"","","","","","","",null,"SORTIES"]
[null,null,null,"Au cours de la journée d’hier, votre enfant est-il sorti de votre domicile ?","T2_SORTIEQ03","A09R_T2_SORTIEQ03",null,421,"donnée","dico",null,"E9AREF_YORN_NSP_F",null,null,"","","","","","","",null,"SORTIES"]
[null,null,null,"En général, votre enfant s’est-il lavé les mains au savon ou avec une solution hydro-alcoolique en revenant à votre logement ?","T2_SORTIEQ07","A09R_T2_SORTIEQ07",null,422,"donnée","dico",null,"E9AREF_SORTIES4F",null,null,"","","","","","","",null,"SORTIES"]
[null,null,null,"Lors de ses déplacements à l’extérieur, votre enfant portait-il une protection respiratoire (masque médical, masque en tissu, masque de chantier, écharpe, foulard) ?","T2_SORTIEQ08","A09R_T2_SORTIEQ08",null,423,"donnée","dico",null,"E9AREF_SORTIES5F",null,null,"","","","","","","",null,"SORTIES"]
[null,null,null,"Votre enfant a-t-il pu se maintenir à plus d’un mètre des personnes qu’il a rencontrées à l’extérieur de votre logement ?","T2_SORTIEQ09","A09R_T2_SORTIEQ09",null,424,"donnée","dico",null,"E9AREF_SORTIES6F",null,null,"","","","","","","",null,"SORTIES"]
[null,null,null,"Dans l’ensemble, votre enfant a-t-il compris facilement les gestes barrières?","T2_SORTIEQ13","A09R_T2_SORTIEQ13",null,425,"donnée","dico",null,"E9AREF_SORTIES10F",null,null,"","","","","","","",null,"SORTIES"]
[null,null,null,"Combien de fois votre enfant est-il sorti de votre domicile dans les 7 derniers jours ?","T2_SORTIEQ10","A09R_T2_SORTIEQ10",null,426,"donnée","dico",null,"E9AREF_SORTIES7F",null,null,"","","","","","","",null,"SORTIES"]
[null,null,null,"Les 7 derniers jours, a-t-il eu l’occasion de retrouver des copains/copines ?","T2_SORTIEQ14","A09R_T2_SORTIEQ14",null,427,"donnée","dico",null,"E9AREF_SORTIES12F",null,null,"","","","","","","",null,"SORTIES"]
[null,null,null,"Où ont-ils passé la plus grande partie du temps ensemble ?","T2_SORTIEQ15","A09R_T2_SORTIEQ15",null,428,"donnée","dico",null,"E9AREF_SORTIES13DECONF",null,null,"","","","","","","",null,"SORTIES"]
[null,null,null,"Depuis les 7 derniers jours, ses frères/sœurs ont-ils eu l’occasion d’inviter des copains/copines à votre domicile ?","T2_SORTIEQ16","A09R_T2_SORTIEQ16",null,429,"donnée","dico",null,"E9AREF_SORTIES14F",null,null,"","","","","","","",null,"SORTIES",null,0]
[null,null,null,"OPINIONS SUR L’ÉPIDÉMIE",null,null,null,null,null,null,null,null,null,null,null,null,null,null,null,null,null,null,null,null,1]
[null,null,null,"Que pensez vous de ce genre d’application ? C’est un bon moyen de vous protéger contre l’épidémie","T2_OPINIONQ21M_A","A09R_T2_OPINIONQ21M_A",null,430,"donnée","dico",null,"E9AREF_COCHE",null,null,"","","","","","","",null,"OPINIONS SUR L’ÉPIDÉMIE"]
[null,null,null,"Que pensez vous de ce genre d’application ? C’est un bon moyen de protéger la société contre l’épidémie","T2_OPINIONQ21M_B","A09R_T2_OPINIONQ21M_B",null,431,"donnée","dico",null,"E9AREF_COCHE",null,null,"","","","","","","",null,"OPINIONS SUR L’ÉPIDÉMIE"]
[null,null,null,"Que pensez vous de ce genre d’application ? C’est un outil de contrôle excessif sur les libertés","T2_OPINIONQ21M_C","A09R_T2_OPINIONQ21M_C",null,432,"donnée","dico",null,"E9AREF_COCHE",null,null,"","","","","","","",null,"OPINIONS SUR L’ÉPIDÉMIE"]
[null,null,null,"Que pensez vous de ce genre d’application ? C’est un outil qui n’est pas adapté à la situation","T2_OPINIONQ21M_D","A09R_T2_OPINIONQ21M_D",null,433,"donnée","dico",null,"E9AREF_COCHE",null,null,"","","","","","","",null,"OPINIONS SUR L’ÉPIDÉMIE"]
[null,null,null,"Que pensez vous de ce genre d’application ? Vous n’avez pas confiance dans ce type d’application","T2_OPINIONQ21M_E","A09R_T2_OPINIONQ21M_E",null,434,"donnée","dico",null,"E9AREF_COCHE",null,null,"","","","","","","",null,"OPINIONS SUR L’ÉPIDÉMIE"]
[null,null,null,"Que pensez vous de ce genre d’application ? Vous n’avez pas d’opinion","T2_OPINIONQ21M_F","A09R_T2_OPINIONQ21M_F",null,435,"donnée","dico",null,"E9AREF_COCHE",null,null,"","","","","","","",null,"OPINIONS SUR L’ÉPIDÉMIE"]
[null,null,null,"Parmi les propositions suivantes quelle est celle qui correspond le mieux à ce que vous pensez ?","T2_OPINIONQ06","A09R_T2_OPINIONQ06",null,436,"donnée","dico",null,"E9AREF_EPID3F",null,null,"","","","","","","",null,"OPINIONS SUR L’ÉPIDÉMIE"]
[null,null,null,"Pour votre vie de famille, le confinement a-t-il eu des effets :","T2_OPINIONQ19","A09R_T2_OPINIONQ19",null,437,"donnée","dico",null,"E9AREF_EPID6F",null,null,"","","","","","","",null,"OPINIONS SUR L’ÉPIDÉMIE",null,0]
[null,null,null,"HABITUDES DE CONSOMMATION",null,null,null,null,null,null,null,null,null,null,null,null,null,null,null,null,null,null,null,null,1]
[null,null,null,"Depuis le début du confinement, votre consommation de tabac (cigarette, cigare, pipe - hors cigarette électronique) a-t-elle changé ?","T2_TABACQ01","A09R_T2_TABACQ01",null,438,"donnée","dico",null,"E9AREF_TABAC1F",null,null,"","","","","","","",null,"HABITUDES DE CONSOMMATION"]
[null,null,null,"D’autres personnes fument-elles à l’intérieur de votre logement (cigarette, cigare, pipe - hors cigarette électronique) ?","T2_TABACQ02","A09R_T2_TABACQ02",null,439,"donnée","dico",null,"E9AREF_YORN",null,null,"","","","","","","",null,"HABITUDES DE CONSOMMATION"]
[null,null,null,"Depuis le début du confinement, votre consommation d’alcool a-t-elle changé ?","T2_ALCOOLQ01","A09R_T2_ALCOOLQ01",null,440,"donnée","dico",null,"E9AREF_ALCOOL1F",null,null,"","","","","","","",null,"HABITUDES DE CONSOMMATION",null,0]
[null,null,null,"BIEN-ÊTRE",null,null,null,null,null,null,null,null,null,null,null,null,null,null,null,null,null,null,null,null,1]
[null,null,null,"Au cours des 15 derniers jours, à quelle fréquence avez-vous été gêné.e par le problème suivant : Sentiment de nervosité, d’anxiété ou de tension ?","T2_SANTEMENTQ01","A09R_T2_SANTEMENTQ01",null,441,"donnée","dico",null,"E9AREF_SANTEMENTALE1F",null,null,"","","","","","","",null,"BIEN-ÊTRE"]
[null,null,null,"Au cours des 15 derniers jours, à quelle fréquence avez-vous été gêné.e par le problème suivant : Incapable d’arrêter de vous inquiéter ou de contrôler vos inquiétudes ?","T2_SANTEMENTQ02","A09R_T2_SANTEMENTQ02",null,442,"donnée","dico",null,"E9AREF_SANTEMENTALE1F",null,null,"","","","","","","",null,"BIEN-ÊTRE"]
[null,null,null,"Au cours des 15 derniers jours, à quelle fréquence avez-vous été gêné.e par le problème suivant : Inquiétudes excessives à propos de tout et de rien ?","T2_SANTEMENTQ03","A09R_T2_SANTEMENTQ03",null,443,"donnée","dico",null,"E9AREF_SANTEMENTALE1F",null,null,"","","","","","","",null,"BIEN-ÊTRE"]
[null,null,null,"Au cours des 15 derniers jours, à quelle fréquence avez-vous été gêné.e par le problème suivant : Difficulté à se détendre ?","T2_SANTEMENTQ04","A09R_T2_SANTEMENTQ04",null,444,"donnée","dico",null,"E9AREF_SANTEMENTALE1F",null,null,"","","","","","","",null,"BIEN-ÊTRE"]
[null,null,null,"Au cours des 15 derniers jours, à quelle fréquence avez-vous été gêné.e par le problème suivant : Agitation telle qu’il est difficile de rester tranquille ?","T2_SANTEMENTQ05","A09R_T2_SANTEMENTQ05",null,445,"donnée","dico",null,"E9AREF_SANTEMENTALE1F",null,null,"","","","","","","",null,"BIEN-ÊTRE"]
[null,null,null,"Au cours des 15 derniers jours, à quelle fréquence avez-vous été gêné.e par le problème suivant : Devenir facilement contrarié.e ou irritable ?","T2_SANTEMENTQ06","A09R_T2_SANTEMENTQ06",null,446,"donnée","dico",null,"E9AREF_SANTEMENTALE1F",null,null,"","","","","","","",null,"BIEN-ÊTRE"]
[null,null,null,"Au cours des 15 derniers jours, à quelle fréquence avez-vous été gêné.e par le problème suivant : Avoir peur que quelque chose d’épouvantable puisse arriver ?","T2_SANTEMENTQ07","A09R_T2_SANTEMENTQ07",null,447,"donnée","dico",null,"E9AREF_SANTEMENTALE1F",null,null,"","","","","","","",null,"BIEN-ÊTRE"]
[null,null,null,"Toujours au cours des 15 derniers jours, à quelle fréquence avez-vous été gêné.e par le problème suivant : Avoir peu d’intérêt ou de plaisir à faire les choses ?","T2_SANTEMENTQ08","A09R_T2_SANTEMENTQ08",null,448,"donnée","dico",null,"E9AREF_SANTEMENTALE1F",null,null,"","","","","","","",null,"BIEN-ÊTRE"]
[null,null,null,"Toujours au cours des 15 derniers jours, à quelle fréquence avez-vous été gêné.e par le problème suivant : Être triste, déprimé.e ou désespéré.e ?","T2_SANTEMENTQ09","A09R_T2_SANTEMENTQ09",null,449,"donnée","dico",null,"E9AREF_SANTEMENTALE1F",null,null,"","","","","","","",null,"BIEN-ÊTRE"]
[null,null,null,"Toujours au cours des 15 derniers jours, à quelle fréquence avez-vous été gêné.e par le problème suivant : Avoir des difficultés à s’endormir ou à rester endormi.e, ou dormir trop ?","T2_SANTEMENTQ10","A09R_T2_SANTEMENTQ10",null,450,"donnée","dico",null,"E9AREF_SANTEMENTALE1F",null,null,"","","","","","","",null,"BIEN-ÊTRE"]
[null,null,null,"Toujours au cours des 15 derniers jours, à quelle fréquence avez-vous été gêné.e par le problème suivant : Se sentir fatigué.e ou manquer d’énergie ?","T2_SANTEMENTQ11","A09R_T2_SANTEMENTQ11",null,451,"donnée","dico",null,"E9AREF_SANTEMENTALE1F",null,null,"","","","","","","",null,"BIEN-ÊTRE"]
[null,null,null,"Toujours au cours des 15 derniers jours, à quelle fréquence avez-vous été gêné.e par le problème suivant : Avoir peu d’appétit ou manger trop ?","T2_SANTEMENTQ12","A09R_T2_SANTEMENTQ12",null,452,"donnée","dico",null,"E9AREF_SANTEMENTALE1F",null,null,"","","","","","","",null,"BIEN-ÊTRE"]
[null,null,null,"Toujours au cours des 15 derniers jours, à quelle fréquence avez-vous été gêné.e par le problème suivant : Avoir une mauvaise opinion de soi-même, ou avoir le sentiment d’être nul.le, ou d’avoir déçu sa famille ou s’être déçu.e soi-même ?","T2_SANTEMENTQ13","A09R_T2_SANTEMENTQ13",null,453,"donnée","dico",null,"E9AREF_SANTEMENTALE1F",null,null,"","","","","","","",null,"BIEN-ÊTRE"]
[null,null,null,"Toujours au cours des 15 derniers jours, à quelle fréquence avez-vous été gêné.e par le problème suivant : Avoir du mal à se concentrer, par exemple, pour lire ou regarder la télévision ?","T2_SANTEMENTQ14","A09R_T2_SANTEMENTQ14",null,454,"donnée","dico",null,"E9AREF_SANTEMENTALE1F",null,null,"","","","","","","",null,"BIEN-ÊTRE"]
[null,null,null,"Toujours au cours des 15 derniers jours, à quelle fréquence avez-vous été gêné.e par le problème suivant : Bouger ou parler si lentement que les autres auraient pu le remarquer. Ou au contraire, être si agité.e que vous avez du mal à tenir en place par rap","T2_SANTEMENTQ15","A09R_T2_SANTEMENTQ15",null,455,"donnée","dico",null,"E9AREF_SANTEMENTALE1F",null,null,"","","","","","","",null,"BIEN-ÊTRE"]
[null,null,null,"Toujours au cours des 15 derniers jours, à quelle fréquence avez-vous été gêné.e par le problème suivant : Penser qu’il vaudrait mieux mourir ou envisager de vous faire du mal d’une manière ou d’une autre ?","T2_SANTEMENTQ16","A09R_T2_SANTEMENTQ16",null,456,"donnée","dico",null,"E9AREF_SANTEMENTALE1F",null,null,"","","","","","","",null,"BIEN-ÊTRE"]
[null,null,null,"Étiez-vous déjà gêné.e par l’un de ces problèmes avant le début du confinement ?","T2_SANTEMENTQ17","A09R_T2_SANTEMENTQ17",null,457,"donnée","dico",null,"E9AREF_YORN",null,null,"","","","","","","",null,"BIEN-ÊTRE"]
[null,null,null,"Diriez-vous que, depuis le début du confinement, la gêne que vous ressentez est :","T2_SANTEMENTQ18","A09R_T2_SANTEMENTQ18",null,458,"donnée","dico",null,"E9AREF_SANTEMENTALE2F",null,null,"","","","","","","",null,"BIEN-ÊTRE"]
[null,null,null,"À quoi attribuez-vous la dégradation de votre état émotionnel ? Le stress ambiant lié à l’épidémie (média, informations …)","T2_SANTEMENTQ19M_A","A09R_T2_SANTEMENTQ19M_A",null,459,"donnée","dico",null,"E9AREF_COCHE",null,null,"","","","","","","",null,"BIEN-ÊTRE"]
[null,null,null,"À quoi attribuez-vous la dégradation de votre état émotionnel ? L’isolement lié au confinement (être loin de sa famille, ses amis...)","T2_SANTEMENTQ19M_B","A09R_T2_SANTEMENTQ19M_B",null,460,"donnée","dico",null,"E9AREF_COCHE",null,null,"","","","","","","",null,"BIEN-ÊTRE"]
[null,null,null,"À quoi attribuez-vous la dégradation de votre état émotionnel ? La crainte de l’infection pour vos proches","T2_SANTEMENTQ19M_C","A09R_T2_SANTEMENTQ19M_C",null,461,"donnée","dico",null,"E9AREF_COCHE",null,null,"","","","","","","",null,"BIEN-ÊTRE"]
[null,null,null,"À quoi attribuez-vous la dégradation de votre état émotionnel ? La gestion difficile des tâches domestiques, des devoirs des enfants, du télétravail","T2_SANTEMENTQ19M_D","A09R_T2_SANTEMENTQ19M_D",null,462,"donnée","dico",null,"E9AREF_COCHE",null,null,"","","","","","","",null,"BIEN-ÊTRE"]
[null,null,null,"À quoi attribuez-vous la dégradation de votre état émotionnel ? La prise en charge de votre enfant handicapé ou avec des difficultés de développement","T2_SANTEMENTQ19M_E","A09R_T2_SANTEMENTQ19M_E",null,463,"donnée","dico",null,"E9AREF_COCHE",null,null,"","","","","","","",null,"BIEN-ÊTRE"]
[null,null,null,"À quoi attribuez-vous la dégradation de votre état émotionnel ? Autre","T2_SANTEMENTQ19M_F","A09R_T2_SANTEMENTQ19M_F",null,464,"donnée","dico",null,"E9AREF_COCHE",null,null,"","","","","","","",null,"BIEN-ÊTRE"]
[null,null,null,"Précisez :","T2_SANTEMENTQ19FP","A09R_T2_SANTEMENTQ19FP",null,465,"non-disponible","text",null,"",null,null,"","","","","","","",null,"BIEN-ÊTRE"]
[null,null,null,"Actuellement prenez-vous des médicaments prescrits en lien avec de l’anxiété, des problèmes de sommeil ou de dépression ?","T2_SANTEMENTQ20","A09R_T2_SANTEMENTQ20",null,466,"donnée","dico",null,"E9AREF_YORN",null,null,"","","","","","","",null,"BIEN-ÊTRE"]
[null,null,null,"Comment a évolué la consommation de ces médicaments depuis le confinement ?","T2_SANTEMENTQ21","A09R_T2_SANTEMENTQ21",null,467,"donnée","dico",null,"E9AREF_SANTEMENTALE4F",null,null,"","","","","","","",null,"BIEN-ÊTRE",null,0]
[null,null,null,"PRÉLÈVEMENTS (ACCORD DE PRINCIPE)\n",null,null,null,null,null,null,null,null,null,null,null,null,null,null,null,null,null,null,null,null,1]
[null,null,null,"Votre enfant accepterait-il ce prélèvement de quelques gouttes de sang au bout du doigt ? (merci de lui poser la question)","T2_PRELEVQ01","A09R_T2_PRELEVQ01",null,468,"donnée","dico",null,"E9AREF_PRELEV1F",null,null,"","","","","","","",null,"PRÉLÈVEMENTS (ACCORD DE PRINCIPE)\n"]
[null,null,null,"L’enfant pour lequel vous remplissez ce questionnaire accepterait-il ce prélèvement de quelques gouttes de sang au bout du doigt ? (merci de lui poser la question)","T2_PRELEVQ01JUM","A09R_T2_PRELEVQ01JUM",null,469,"donnée","dico",null,"E9AREF_PRELEV1F",null,null,"","","","","","","",null,"PRÉLÈVEMENTS (ACCORD DE PRINCIPE)\n"]
[null,null,null,"Souhaitez-vous que l’enfant pour lequel vous remplissez ce questionnaire bénéficie en premier de ce prélèvement ? (le kit de prélèvement que vous recevrez lui sera exclusivement destiné)","T2_PRELEVQ02JUM","A09R_T2_PRELEVQ02JUM",null,470,"donnée","dico",null,"E9AREF_YORN",null,null,"","","","","","","",null,"PRÉLÈVEMENTS (ACCORD DE PRINCIPE)\n"]
[null,null,null,"Accepteriez-vous de faire ce prélèvement pour vous même ?","T2_PRELEVQ02","A09R_T2_PRELEVQ02",null,471,"donnée","dico",null,"E9AREF_YORN",null,null,"","","","","","","",null,"PRÉLÈVEMENTS (ACCORD DE PRINCIPE)\n"]
[null,null,null,"L’autre parent de l’enfant Elfe accepterait-il de faire ce prélèvement pour lui même?","T2_PRELEVQ03","A09R_T2_PRELEVQ03",null,472,"donnée","dico",null,"E9AREF_YORN_NSP_F",null,null,"","","","","","","",null,"PRÉLÈVEMENTS (ACCORD DE PRINCIPE)\n",null,0]
[null,null,null,"CROISSANCE ET DÉVELOPPEMENT DE L’ENFANT",null,null,null,null,null,null,null,null,null,null,null,null,null,null,null,null,null,null,null,null,1]
[null,null,null,"Avez-vous la possibilité de peser votre enfant sur une balance ?","T2_SANTEQPDS","A09R_T2_SANTEQPDS",null,480,"donnée","dico",null,"E9AREF_YORN",null,null,"","","","","","","",null,"CROISSANCE ET DÉVELOPPEMENT DE L’ENFANT"]
[null,null,null,"Quel est le poids de votre enfant en kg ?","T2_SANTEQPDS1","A09R_T2_SANTEQPDS1",null,481,"donnée","dico",null,"",null,null,"","","","","","","",null,"CROISSANCE ET DÉVELOPPEMENT DE L’ENFANT"]
[null,null,null,"Quelle est la taille actuelle de votre enfant ? (en cm)","T2_SANTEQTAIL","A09R_T2_SANTEQTAIL",null,482,"donnée","dico",null,"",null,null,"","","","","","","",null,"CROISSANCE ET DÉVELOPPEMENT DE L’ENFANT",null,0]

{"sheet":"E9A_COVID_VARIABLES","index":12,"n_rows":31,"n_cols":73,"rows_kept":31,"cut":false,"hidden":false,"merged":[]}
["SELECTION\n(par variable ou par section)","SELECTION\n(par thème 1)","SELECTION\n(par QUEST STANDARD)","LABEL","QUESTION QUESTIONNAIRE","QUESTION BASE","QUESTION BASE",null,"TYPE","FORMAT","CHAPEAU","DICO","DESCRIPTION","CONTRÔLE","THEME(01)","THEME(02)","THEME(03)","THEME1","THEME2","THEME3","THEME4","THEME5","THEME6","QUEST STANDARD","THEME_TITRE","","","","","","","","","","","","","","","","","","","","","","","","","","E9A_SAPRIS_VARIABLES","E9A_SAPRIS_VARIABLES","","","","","","","","","","","","","","","","","","","","",""]
[null,null,null,{"$f":"CONCATENATE(\"Sélection totale : \",COUNTIFS(A:A,\"X\",I:I,\"*\")+COUNTIFS(B:B,\"X\",I:I,\"*\")+COUNTIFS(C:C,\"X\",I:I,\"*\"),\" variable(s)\")","v":"Sélection totale : 0 variable(s)"},null,null,null,null,null,null,null,null,null,null,null,null,null,null,null,null,null,null,null,null,null,null,{"$f":"COUNTIFS(A:A,\"X\",I:I,\"non-disponible\")+COUNTIFS(B:B,\"X\",I:I,\"non-disponible\")+COUNTIFS(C:C,\"X\",I:I,\"non-disponible\")","v":0},{"$f":"SUM(COUNTIFS($A:$A,\"X\",$E:$E,{\"ACRELI\";\"ACCHRET\";\"ACMUSUL\";\"LRELI\";\"QLCHRET\";\"QLMUSUL\";\"POLIT\"})+COUNTIFS($B:$B,\"X\",$E:$E,{\"ACRELI\";\"ACCHRET\";\"ACMUSUL\";\"LRELI\";\"QLCHRET\";\"QLMUSUL\";\"POLIT\"})+COUNTIFS($C:$C,\"X\",$E:$E,{\"ACRELI\";\"ACCHRET\";\"ACMUSUL\";\"LRELI\";\"QLCHRET\";\"QLMUSUL\";\"POLIT\"}))","v":0}]
[null,null,null,"SAPRIS VARIABLES",null,null,null,null,null,null,null,null,null,null,null,null,null,null,null,null,null,null,null,null,1]
[null,null,null,"Sexe enfant","SEXE","A00_SEXE",null,1,"donnée","dico",null,"SEXE",null,null,"","","","","","","",""]
[null,null,null,"Age gest en semaines révolues","AGEGEST","A00_AGEGEST",null,2,"donnée","dico",null,"",null,null,"","","","","","","",""]
[null,null,null,"Nationalité Mère (à la naissance)","NATMER","A00_NATMER",null,3,"donnée","dico",null,"NAT",null,null,"","","","","","","",""]
[null,null,null,"Nationalité Père ou conjoint (à la naissance)","NATPER","A00_NATPER",null,4,"donnée","dico",null,"NAT",null,null,"","","","","","","",""]
[null,null,null,"Pays de naissance Mère","PAYSMER","A00_PAYSMER",null,5,"donnée","dico",null,"PAYS",null,null,"","","","","","","",""]
[null,null,null,"Pays de naissance Père ou conjoint","PAYSPER","A00_PAYSPER",null,6,"donnée","dico",null,"PAYS",null,null,"","","","","","","",""]
[null,null,null,"PCS Mère (à la naissance)","PCSMER","A00_PCSMER",null,7,"donnée","dico",null,"PCS",null,null,"","","","","","","",""]
[null,null,null,"PCS Père ou conjoint (à la naissance)","PCSPER","A00_PCSPER",null,8,"donnée","dico",null,"PCS",null,null,"","","","","","","",""]
[null,null,null,"Niveau étude Mère (à la naissance)","ETUDMER","A00_ETUDMER",null,9,"donnée","dico",null,"ETUD",null,null,"","","","","","","",""]
[null,null,null,"Niveau étude Père ou conjoint (à la naissance)","ETUDPER","A00_ETUDPER",null,10,"donnée","dico",null,"ETUD",null,null,"","","","","","","",""]
[null,null,null,"Age Mère (à la naissance)","AGEMER","A00_AGEMER",null,11,"donnée","dico",null,"",null,null,"","","","","","","",""]
[null,null,null,"Age Père ou conjoint (à la naissance)","AGEPER","A00_AGEPER",null,12,"donnée","dico",null,"",null,null,"","","","","","","",""]
[null,null,null,"Cohorte (Elfe / EPIPAGE)","COHORTE","A00_COHORTE",null,13,"donnée","dico",null,"COH",null,null,"","","","","","","",""]
[null,null,null,"Participation enquête T1","Part_T1","A09R_Part_T1",null,14,"donnée","dico",null,"",null,null,"","","","","","","",""]
[null,null,null,"Participation enquête T2","Part_T2","A09R_Part_T2",null,15,"donnée","dico",null,"",null,null,"","","","","","","",""]
[null,null,null,"PCS Mère (lors de l'enquête SAPRIS)","PCSMER","A09R_PCSMER",null,16,"donnée","dico",null,"PCS",null,null,"","","","","","","",""]
[null,null,null,"PCS Père ou conjoint (lors de l'enquête SAPRIS)","PCSPER","A09R_PCSPER",null,17,"donnée","dico",null,"PCS",null,null,"","","","","","","",""]
[null,null,null,"PCS conjuguée Couple (lors de l'enquête SAPRIS)","PCS_COUPLE","A09R_PCS_COUPLE",null,18,"donnée","dico",null,"PCSC",null,null,"","","","","","","",""]
[null,null,null,"Type de famille (lors de l'enquête SAPRIS)","FAMILLE","A09R_FAMILLE",null,19,"donnée","dico",null,"FAMILLE",null,null,"","","","","","","",""]
[null,null,null,"Taille fratrie (lors de l'enquête SAPRIS)","FRATR","A09R_FRATR",null,20,"donnée","dico",null,"FRATR",null,null,"","","","","","","",""]
[null,null,null,"Type de logement (lors de l'enquête SAPRIS)","TYPLOGT","A09R_TYPLOGT",null,21,"donnée","dico",null,"LOGT",null,null,"","","","","","","",""]
[null,null,null,"Ressenti situation financière (lors de l'enquête SAPRIS)","SITUA_FI","A09R_SITUA_FI",null,22,"donnée","dico",null,"FID",null,null,"","","","","","","",""]
[null,null,null,"Situation emploi Mère (lors de l'enquête SAPRIS)","Emploi_MER","A09R_Emploi_MER",null,23,"donnée","dico",null,"EMPM",null,null,"","","","","","","",""]
[null,null,null,"Situation emploi Père ou conjoint (lors de l'enquête SAPRIS)","Emploi_PER","A09R_Emploi_PER",null,24,"donnée","dico",null,"EMPP",null,null,"","","","","","","",""]
[null,null,null,"Situation emploi conjuguée Couple (lors de l'enquête SAPRIS)","Emploi_Foyer","A09R_Emploi_Foyer",null,25,"donnée","dico",null,"EMPC",null,null,"","","","","","","",""]
[null,null,null,"Region du logement (lors de l'enquête SAPRIS)","REGION","A09R_REGION",null,26,"donnée","dico",null,"REGION",null,null,"","","","","","","",""]
[null,null,null,"Region regroupée du logement (lors de l'enquête SAPRIS)","REGION_R","A09R_REGION_R",null,27,"donnée","dico",null,"REGIONR",null,null,"","","","","","","",""]
[null,null,null,"Estimation des troubles socio-émotionnels","SDQ","A09R_SDQ",null,28,"donnée","dico",null,null,null,null,"","","","","","","","",null,null,0]